{"text_format":"1","workbook":"xlsx","n_sheets":20,"sheets":["Accueil","Dossards","Effectifs par collèges","Classt BF1","Classt BF 2","Classt Scratch BG","Classt BG1","Classt BG2","Classt Scratch MinF","Classt Min F","Classt Cadettes","Classt Scratch MinG","Classt MinG","Classt Cadets G","Macro MinG","MacroBF","Macro BG","Macro MinF","Résult Classes 3ème","d"],"not_rendered":{"charts":0,"images":6,"macros":1,"external_links":0,"defined_names":33,"comments":0,"pivot_tables":0},"unopened":[],"bounds":{"document_bytes":16777216,"sheet_cells":100000,"rows_first":2000,"rows_last":500,"rows_between":2000,"halvings":0,"cell_chars":16384,"cell_head_chars":4096},"cells_cut":0,"cells_raw":0,"read":"whole","date_system":"1900"}

{"sheet":"Accueil","index":0,"n_rows":10,"n_cols":4,"rows_kept":10,"cut":false,"hidden":false,"merged":[[0,0,0,4],[3,0,3,2]]}
["GESTION DU CROSS DE DISTRICT"]
[]
[]
["AFFECTER LES DOSSARDS AUX ELEVES, LA CATEGORIE, RENTRER SUR LA FEUILLE EFFECTIFS LES NOMS DES ETABLISSEMENTS",null,null,"\n"]
["COURSES"]
[]
[1,"BENJAMINES FILLES CLASSEMENT SCRATCH"]
[2,"BENJAMINS GARCONS CLASSEMENT SCRATCH"]
[3,"MINIMES FILLES ET CADETTES FILLES"]
[4,"MINIMES GARCONS ET CADETS GARCONS"]

{"sheet":"Dossards","index":1,"n_rows":5001,"n_cols":16,"rows_kept":5001,"cut":false,"hidden":false,"merged":[]}
["DOSSARDS","NOM","PRENOM","DATNAIS","SEXE","CAT","ETABLISSEMENTS","VILLE","N°"]
[1,"NSEKE","Gaël",2005,"G",{"$f":"IF(D2=\"\",\"\",IF(E2=\"f\",LOOKUP(D2,cat_unss,cat_f),LOOKUP(D2,cat_unss,cat_g)))","v":"BG1"},"BROSSOLETTE","MELUN"]
[2,"SOUGMI","Badre",2005,"G","BG1","BROSSOLETTE","MELUN",null,null,null,"CATEGORIES \nUNSS",null,"CAT_G","CAT_F"]
[3,"KOUKABA","Yanis",2005,"G","BG1","BROSSOLETTE","MELUN",null,null,null,"CAT_UNSS",{"$f":"M5-1","v":1998},"JG","JF"]
[4,"NKOUNKOU","Desthy",2005,"G","BG1","BROSSOLETTE","MELUN",null,null,null,null,1999,"JG","JF"]
[5,"N'GANGA","Oualem",2005,"G","BG1","BROSSOLETTE","MELUN",null,null,null,null,2000,"CG","CF"]
[6,"ZEGHOUDI","Saad",2005,"G","BG1","BROSSOLETTE","MELUN",null,null,null,null,2001,"CG","CF"]
[7,"KIYINDO","Yvan",2005,"G","BG1","BROSSOLETTE","MELUN",null,null,null,null,2002,"MG","MF"]
[8,"KIMOKO LESA","Emery",2005,"G","BG1","BROSSOLETTE","MELUN",null,null,null,null,2003,"MG","MF"]
[9,"FOFANA","Bandiougou",2005,"G","BG1","BROSSOLETTE","MELUN",null,null,null,null,2004,"BG2","BF2"]
[10,"NOKO LAND","Horlan",2005,"G","BG1","BROSSOLETTE","MELUN",null,null,null,null,{"$f":"IF(MONTH(TODAY())<YEAR(TODAY())-12,YEAR(TODAY())-11)","v":2005},"BG1","BF1"]
[11,"LOPES BORGES","Killian",2005,"G","BG1","BROSSOLETTE","MELUN",null,null,null,"COLLEGES","Num AS",null,null,"VILLES"]
[12,"HAMDI","Yassine",2005,"G","BG1","BROSSOLETTE","MELUN",null,null,null,"BROSSOLETTE","08056",null,null,"MELUN"]
[13,"TASTAN","Efe",2005,"G","BG1","BROSSOLETTE","MELUN",null,null,null,"CAPUCINS","08054",null,null,"DAMMARIE"]
[14,"TEMIROV","Malik",2005,"G","BG1","BROSSOLETTE","MELUN",null,null,null,"CH PEGUY","08094",null,null,"VERNEUIL"]
[15,"SOUALMI","Bassem",2005,"G","BG1","BROSSOLETTE","MELUN",null,null,null,"CHOPIN",null,null,null,"VOISENON"]
[16,"LOPES","Yohann",2004,"G","BG2","BROSSOLETTE","MELUN",null,null,null,"DE PISAN","08119",null,null,"LE MEE"]
[17,"NKOUKA","Mondesir",2004,"G","BG2","BROSSOLETTE","MELUN",null,null,null,"DOISNEAU","08023",null,null,"PONTHIERRY"]
[18,"BAGBEMA","Zoumana",2004,"G","BG2","BROSSOLETTE","MELUN",null,null,null,"ELSA TRIOLET","08040",null,null,"PERTHES"]
[19,"FOFANA","Maye",2004,"G","BG2","BROSSOLETTE","MELUN",null,null,null,"F VILLON","08075",null,null,"LE CHATELET"]
[20,"SIDIBE","Mamadou",2004,"G","BG2","BROSSOLETTE","MELUN",null,null,null,"J AMYOT","08055",null,null,"VAUX"]
[21,"MOHAMED","Akim",2004,"G","BG2","BROSSOLETTE","MELUN",null,null,null,"J D'ARC"]
[22,"HAMMANI","Ilyess",2004,"G","BG2","BROSSOLETTE","MELUN",null,null,null,"LA FONTAINE"]
[23,"TRABELSI","Amir",2004,"G","BG2","BROSSOLETTE","MELUN",null,null,null,"LA MARE AUX CHAMPS"]
[24,"MUKENDI","Jacknesti",2004,"G","BG2","BROSSOLETTE","MELUN",null,null,null,"NAZARETH","08024"]
[25,"DIPEIN","Calvin",2004,"G","BG2","BROSSOLETTE","MELUN",null,null,null,"R BONHEUR","08039"]
[26,"VIAL","Kévin",2004,"G","BG2","BROSSOLETTE","MELUN",null,null,null,"POLITZER"]
[27,"SIANNARD BAZOUSSI","Alexandre",2004,"G","BG2","BROSSOLETTE","MELUN"]
[28,"ASCOFARE","Djibril",2004,"G","BG2","BROSSOLETTE","MELUN"]
[29,"BUENO FLORENCE","Djibril",2004,"G","BG2","BROSSOLETTE","MELUN"]
[30,"BOUABID","Quentin",2004,"G","BG2","BROSSOLETTE","MELUN"]
[31,"DIA","Djeïnaba",2005,"F","BF1","BROSSOLETTE","MELUN"]
[32,"DRAME SIMAGA","Bintou",2005,"F","BF1","BROSSOLETTE","MELUN"]
[33,"DANFA","Aissatou",2005,"F","BF1","BROSSOLETTE","MELUN"]
[34,"TRAORE","Kangne",2005,"F","BF1","BROSSOLETTE","MELUN"]
[35,"BERRICHI","Shahinez",2005,"F","BF1","BROSSOLETTE","MELUN"]
[36,"SOUNGA","Cheryl",2005,"F","BF1","BROSSOLETTE","MELUN"]
[37,"SASSI","Iman",2005,"F","BF1","BROSSOLETTE","MELUN"]
[38,"BERKACHE","Thayri",2005,"F","BF1","BROSSOLETTE","MELUN"]
[39,"KARTAL","Meryem",2005,"F","BF1","BROSSOLETTE","MELUN"]
[40,"GUENTOUH","Shayma",2005,"F","BF1","BROSSOLETTE","MELUN"]
[41,"EL ABIDI","Ibtissem",2005,"F","BF1","BROSSOLETTE","MELUN"]
[42,"SAHRAOUI LE GRILL","Naëla",2005,"F","BF1","BROSSOLETTE","MELUN"]
[43,"CHAHID","Khadija",2005,"F","BF1","BROSSOLETTE","MELUN"]
[44,"KHELOUFI ","Mariam",2005,"F","BF1","BROSSOLETTE","MELUN"]
[45,"MAVY","Dorianne",2005,"F","BF1","BROSSOLETTE","MELUN"]
[46,"MOUNGABIO","Ornella",2004,"F","BF2","BROSSOLETTE","MELUN"]
[47,"MEKHACHENE","Wassila",2004,"F","BF2","BROSSOLETTE","MELUN"]
[48,"AYAD","Anissa",2004,"F","BF2","BROSSOLETTE","MELUN"]
[49,"YILDIZ","Berivan",2004,"F","BF2","BROSSOLETTE","MELUN"]
[50,"YANDOKOUZOU","Audrey",2004,"F","BF2","BROSSOLETTE","MELUN"]
[51,"BOUABDALLAH","Syham",2004,"F","BF2","BROSSOLETTE","MELUN"]
[52,"BATSIMBA","Julie",2004,"F","BF2","BROSSOLETTE","MELUN"]
[53,"SISSOKO","Aissetou",2004,"F","BF2","BROSSOLETTE","MELUN"]
[54,"SYMPHOR","Lana",2004,"F","BF2","BROSSOLETTE","MELUN"]
[55,"CONDE","Mama ",2004,"F","BF2","BROSSOLETTE","MELUN"]
[56,"GUERRY","Ness",2004,"F","BF2","BROSSOLETTE","MELUN"]
[57,"AUGUSTO","Camille",2004,"F","BF2","BROSSOLETTE","MELUN"]
[58,"THOMIAS","Céliane",2004,"F","BF2","BROSSOLETTE","MELUN"]
[59,"DESZELUS","Camille",2004,"F","BF2","BROSSOLETTE","MELUN"]
[60,"DIASUKA MBUDI","Christ vie",2004,"F","BF2","BROSSOLETTE","MELUN"]
[61,"KABEYA MBUYI","Angèle",2004,"F","BF2","BROSSOLETTE","MELUN"]
[62,"MLEHI","Maëva  ",2003,"F","MF","BROSSOLETTE","MELUN"]
[63,"LELO ","Yama",2003,"F","MF","BROSSOLETTE","MELUN"]
[64,"RABHI","Abla",2003,"F","MF","BROSSOLETTE","MELUN"]
[65,"NKOUNKOU","Victoire",2003,"F",{"$f":"IF(D66=\"\",\"\",IF(E66=\"f\",LOOKUP(D66,cat_unss,cat_f),LOOKUP(D66,cat_unss,cat_g)))","v":"MF"},"BROSSOLETTE","MELUN"]
[66,"BOZANGA","Charmide",2003,"F","MF","BROSSOLETTE","MELUN"]
[67,"CHABLIS","Merveille",2003,"F","MF","BROSSOLETTE","MELUN"]
[68,"GABRIEL","Maëva  ",2003,"F","MF","BROSSOLETTE","MELUN"]
[69,"LUC","Chloë",2003,"F","MF","BROSSOLETTE","MELUN"]
[70,"KHODJA","Amel",2003,"F","MF","BROSSOLETTE","MELUN"]
[71,"MAGASSA","Dialla",2003,"F","MF","BROSSOLETTE","MELUN"]
[72,"TURINAY","Alison",2003,"F","MF","BROSSOLETTE","MELUN"]
[73,"OSWALD","Vicky",2003,"F","MF","BROSSOLETTE","MELUN"]
[74,"AUGUSTO","Elanore",2003,"F","MF","BROSSOLETTE","MELUN"]
[75,"BOUNABI","Lyna",2003,"F","MF","BROSSOLETTE","MELUN"]
[76,"VANG","Océane",2003,"F","MF","BROSSOLETTE","MELUN"]
[77,"HOUAT","Abdelali",2003,"G","MG","BROSSOLETTE","MELUN"]
[78,"KETCHAYA ","Brayane",2003,"G","MG","BROSSOLETTE","MELUN"]
[79,"BADZOUKOULA","Glodie",2003,"G","MG","BROSSOLETTE","MELUN"]
[80,"KERTEL","Kerim",2003,"G","MG","BROSSOLETTE","MELUN"]
[81,"MAMPASI","Schilo",2003,"G","MG","BROSSOLETTE","MELUN"]
[82,"KAZADI","Lenny",2003,"G","MG","BROSSOLETTE","MELUN"]
[83,"COULIBALY","Kandara",2003,"G","MG","BROSSOLETTE","MELUN"]
[84,"SABRI","Adel",2003,"G","MG","BROSSOLETTE","MELUN"]
[85,"DURSUN","Kadir",2003,"G","MG","BROSSOLETTE","MELUN"]
[86,"MATTON","Owen",2003,"G","MG","BROSSOLETTE","MELUN"]
[87,"FRATELLO","Robin",2003,"G","MG","BROSSOLETTE","MELUN"]
[88,"LANDU DIAZOLA","Yohan ",2003,"G","MG","BROSSOLETTE","MELUN"]
[89,"LAZREG","Mehdi",2003,"G","MG","BROSSOLETTE","MELUN"]
[90,"METAL","Exaucé",2003,"G","MG","BROSSOLETTE","MELUN"]
[91,"BARRY","Boubacar",2003,"G","MG","BROSSOLETTE","MELUN"]
[92,null,null,null,null,"","BROSSOLETTE","MELUN"]
[93,null,null,null,null,"","BROSSOLETTE","MELUN"]
[94,null,null,null,null,"","BROSSOLETTE","MELUN"]
[95,null,null,null,null,"","BROSSOLETTE","MELUN"]
[96,null,null,null,null,"","BROSSOLETTE","MELUN"]
[97,null,null,null,null,"","BROSSOLETTE","MELUN"]
[98,null,null,null,null,"","BROSSOLETTE","MELUN"]
[99,null,null,null,null,"","BROSSOLETTE","MELUN"]
[100,null,null,null,null,"","BROSSOLETTE","MELUN"]
[101,null,null,null,null,"","BROSSOLETTE","MELUN"]
[102,null,null,null,null,"","BROSSOLETTE","MELUN"]
[103,null,null,null,null,"","BROSSOLETTE","MELUN"]
[104,null,null,null,null,"","BROSSOLETTE","MELUN"]
[105,null,null,null,null,"","BROSSOLETTE","MELUN"]
[106,null,null,null,null,"","BROSSOLETTE","MELUN"]
[107,null,null,null,null,"","BROSSOLETTE","MELUN"]
[108,null,null,null,null,"","BROSSOLETTE","MELUN"]
[109,null,null,null,null,"","BROSSOLETTE","MELUN"]
[110,null,null,null,null,"","BROSSOLETTE","MELUN"]
[111,null,null,null,null,"","BROSSOLETTE","MELUN"]
[112,null,null,null,null,"","BROSSOLETTE","MELUN"]
[113,null,null,null,null,"","BROSSOLETTE","MELUN"]
[114,null,null,null,null,"","BROSSOLETTE","MELUN"]
[115,null,null,null,null,"","BROSSOLETTE","MELUN"]
[116,null,null,null,null,"","BROSSOLETTE","MELUN"]
[117,null,null,null,null,"","BROSSOLETTE","MELUN"]
[118,null,null,null,null,"","BROSSOLETTE","MELUN"]
[119,null,null,null,null,"","BROSSOLETTE","MELUN"]
[120,null,null,null,null,"","BROSSOLETTE","MELUN"]
[121,null,null,null,null,"","BROSSOLETTE","MELUN"]
[122,null,null,null,null,"","BROSSOLETTE","MELUN"]
[123,null,null,null,null,"","BROSSOLETTE","MELUN"]
[124,null,null,null,null,"","BROSSOLETTE","MELUN"]
[125,null,null,null,null,"","BROSSOLETTE","MELUN"]
[126,null,null,null,null,"","BROSSOLETTE","MELUN"]
[127,null,null,null,null,"","BROSSOLETTE","MELUN"]
[128,null,null,null,null,"","BROSSOLETTE","MELUN"]
[129,null,null,null,null,{"$f":"IF(D130=\"\",\"\",IF(E130=\"f\",LOOKUP(D130,cat_unss,cat_f),LOOKUP(D130,cat_unss,cat_g)))","v":""},"BROSSOLETTE","MELUN"]
[130,null,null,null,null,"","BROSSOLETTE","MELUN"]
[131,null,null,null,null,"","BROSSOLETTE","MELUN"]
[132,null,null,null,null,"","BROSSOLETTE","MELUN"]
[133,null,null,null,null,"","BROSSOLETTE","MELUN"]
[134,null,null,null,null,"","BROSSOLETTE","MELUN"]
[135,null,null,null,null,"","BROSSOLETTE","MELUN"]
[136,null,null,null,null,"","BROSSOLETTE","MELUN"]
[137,null,null,null,null,"","BROSSOLETTE","MELUN"]
[138,null,null,null,null,"","BROSSOLETTE","MELUN"]
[139,null,null,null,null,"","BROSSOLETTE","MELUN"]
[140,null,null,null,null,"","BROSSOLETTE","MELUN"]
[141,null,null,null,null,"","BROSSOLETTE","MELUN"]
[142,null,null,null,null,"","BROSSOLETTE","MELUN"]
[143,null,null,null,null,"","BROSSOLETTE","MELUN"]
[144,null,null,null,null,"","BROSSOLETTE","MELUN"]
[145,null,null,null,null,"","BROSSOLETTE","MELUN"]
[146,null,null,null,null,"","BROSSOLETTE","MELUN"]
[147,null,null,null,null,"","BROSSOLETTE","MELUN"]
[148,null,null,null,null,"","BROSSOLETTE","MELUN"]
[149,null,null,null,null,"","BROSSOLETTE","MELUN"]
[150,null,null,null,null,"","BROSSOLETTE","MELUN"]
[151,null,null,null,null,"","BROSSOLETTE","MELUN"]
[152,null,null,null,null,"","BROSSOLETTE","MELUN"]
[153,null,null,null,null,"","BROSSOLETTE","MELUN"]
[154,null,null,null,null,"","BROSSOLETTE","MELUN"]
[155,null,null,null,null,"","BROSSOLETTE","MELUN"]
[156,null,null,null,null,"","BROSSOLETTE","MELUN"]
[157,null,null,null,null,"","BROSSOLETTE","MELUN"]
[158,null,null,null,null,"","BROSSOLETTE","MELUN"]
[159,null,null,null,null,"","BROSSOLETTE","MELUN"]
[160,null,null,null,null,"","BROSSOLETTE","MELUN"]
[161,null,null,null,null,"","BROSSOLETTE","MELUN"]
[162,null,null,null,null,"","BROSSOLETTE","MELUN"]
[163,null,null,null,null,"","BROSSOLETTE","MELUN"]
[164,null,null,null,null,"","BROSSOLETTE","MELUN"]
[165,null,null,null,null,"","BROSSOLETTE","MELUN"]
[166,null,null,null,null,"","BROSSOLETTE","MELUN"]
[167,null,null,null,null,"","BROSSOLETTE","MELUN"]
[168,null,null,null,null,"","BROSSOLETTE","MELUN"]
[169,null,null,null,null,"","BROSSOLETTE","MELUN"]
[170,null,null,null,null,"","BROSSOLETTE","MELUN"]
[171,null,null,null,null,"","BROSSOLETTE","MELUN"]
[172,null,null,null,null,"","BROSSOLETTE","MELUN"]
[173,null,null,null,null,"","BROSSOLETTE","MELUN"]
[174,null,null,null,null,"","BROSSOLETTE","MELUN"]
[175,null,null,null,null,"","BROSSOLETTE","MELUN"]
[176,null,null,null,null,"","BROSSOLETTE","MELUN"]
[177,null,null,null,null,"","BROSSOLETTE","MELUN"]
[178,null,null,null,null,"","BROSSOLETTE","MELUN"]
[179,null,null,null,null,"","BROSSOLETTE","MELUN"]
[180,null,null,null,null,"","BROSSOLETTE","MELUN"]
[181,null,null,null,null,"","BROSSOLETTE","MELUN"]
[182,null,null,null,null,"","BROSSOLETTE","MELUN"]
[183,null,null,null,null,"","BROSSOLETTE","MELUN"]
[184,null,null,null,null,"","BROSSOLETTE","MELUN"]
[185,null,null,null,null,"","BROSSOLETTE","MELUN"]
[186,null,null,null,null,"","BROSSOLETTE","MELUN"]
[187,null,null,null,null,"","BROSSOLETTE","MELUN"]
[188,null,null,null,null,"","BROSSOLETTE","MELUN"]
[189,null,null,null,null,"","BROSSOLETTE","MELUN"]
[190,null,null,null,null,"","BROSSOLETTE","MELUN"]
[191,null,null,null,null,"","BROSSOLETTE","MELUN"]
[192,null,null,null,null,"","BROSSOLETTE","MELUN"]
[193,null,null,null,null,{"$f":"IF(D194=\"\",\"\",IF(E194=\"f\",LOOKUP(D194,cat_unss,cat_f),LOOKUP(D194,cat_unss,cat_g)))","v":""},"BROSSOLETTE","MELUN"]
[194,null,null,null,null,"","BROSSOLETTE","MELUN"]
[195,null,null,null,null,"","BROSSOLETTE","MELUN"]
[196,null,null,null,null,"","BROSSOLETTE","MELUN"]
[197,null,null,null,null,"","BROSSOLETTE","MELUN"]
[198,null,null,null,null,"","BROSSOLETTE","MELUN"]
[199,null,null,null,null,"","BROSSOLETTE","MELUN"]
[200,null,null,null,null,"","BROSSOLETTE","MELUN"]
[201,null,null,null,null,"","BROSSOLETTE","MELUN"]
[202,null,null,null,null,"","BROSSOLETTE","MELUN"]
[203,null,null,null,null,"","BROSSOLETTE","MELUN"]
[204,null,null,null,null,"","BROSSOLETTE","MELUN"]
[205,null,null,null,null,"","BROSSOLETTE","MELUN"]
[206,null,null,null,null,"","BROSSOLETTE","MELUN"]
[207,null,null,null,null,"","BROSSOLETTE","MELUN"]
[208,null,null,null,null,"","BROSSOLETTE","MELUN"]
[209,null,null,null,null,"","BROSSOLETTE","MELUN"]
[210,null,null,null,null,"","BROSSOLETTE","MELUN"]
[211,null,null,null,null,"","BROSSOLETTE","MELUN"]
[212,null,null,null,null,"","BROSSOLETTE","MELUN"]
[213,null,null,null,null,"","BROSSOLETTE","MELUN"]
[214,null,null,null,null,"","BROSSOLETTE","MELUN"]
[215,null,null,null,null,"","BROSSOLETTE","MELUN"]
[216,null,null,null,null,"","BROSSOLETTE","MELUN"]
[217,null,null,null,null,"","BROSSOLETTE","MELUN"]
[218,null,null,null,null,"","BROSSOLETTE","MELUN"]
[219,null,null,null,null,"","BROSSOLETTE","MELUN"]
[220,null,null,null,null,"","BROSSOLETTE","MELUN"]
[221,null,null,null,null,"","BROSSOLETTE","MELUN"]
[222,null,null,null,null,"","BROSSOLETTE","MELUN"]
[223,null,null,null,null,"","BROSSOLETTE","MELUN"]
[224,null,null,null,null,"","BROSSOLETTE","MELUN"]
[225,null,null,null,null,"","BROSSOLETTE","MELUN"]
[226,null,null,null,null,"","BROSSOLETTE","MELUN"]
[227,null,null,null,null,"","BROSSOLETTE","MELUN"]
[228,null,null,null,null,"","BROSSOLETTE","MELUN"]
[229,null,null,null,null,"","BROSSOLETTE","MELUN"]
[230,null,null,null,null,"","BROSSOLETTE","MELUN"]
[231,null,null,null,null,"","BROSSOLETTE","MELUN"]
[232,null,null,null,null,"","BROSSOLETTE","MELUN"]
[233,null,null,null,null,"","BROSSOLETTE","MELUN"]
[234,null,null,null,null,"","BROSSOLETTE","MELUN"]
[235,null,null,null,null,"","BROSSOLETTE","MELUN"]
[236,null,null,null,null,"","BROSSOLETTE","MELUN"]
[237,null,null,null,null,"","BROSSOLETTE","MELUN"]
[238,null,null,null,null,"","BROSSOLETTE","MELUN"]
[239,null,null,null,null,"","BROSSOLETTE","MELUN"]
[240,null,null,null,null,"","BROSSOLETTE","MELUN"]
[241,null,null,null,null,"","BROSSOLETTE","MELUN"]
[242,null,null,null,null,"","BROSSOLETTE","MELUN"]
[243,null,null,null,null,"","BROSSOLETTE","MELUN"]
[244,null,null,null,null,"","BROSSOLETTE","MELUN"]
[245,null,null,null,null,"","BROSSOLETTE","MELUN"]
[246,null,null,null,null,"","BROSSOLETTE","MELUN"]
[247,null,null,null,null,"","BROSSOLETTE","MELUN"]
[248,null,null,null,null,"","BROSSOLETTE","MELUN"]
[249,null,null,null,null,"","BROSSOLETTE","MELUN"]
[250,null,null,null,null,"","BROSSOLETTE","MELUN"]
[251,null,null,null,null,"","BROSSOLETTE","MELUN"]
[252,null,null,null,null,"","BROSSOLETTE","MELUN"]
[253,null,null,null,null,"","BROSSOLETTE","MELUN"]
[254,null,null,null,null,"","BROSSOLETTE","MELUN"]
[255,null,null,null,null,"","BROSSOLETTE","MELUN"]
[256,null,null,null,null,"","BROSSOLETTE","MELUN"]
[257,null,null,null,null,{"$f":"IF(D258=\"\",\"\",IF(E258=\"f\",LOOKUP(D258,cat_unss,cat_f),LOOKUP(D258,cat_unss,cat_g)))","v":""},"BROSSOLETTE","MELUN"]
[258,null,null,null,null,"","BROSSOLETTE","MELUN"]
[259,null,null,null,null,"","BROSSOLETTE","MELUN"]
[260,null,null,null,null,"","BROSSOLETTE","MELUN"]
[261,null,null,null,null,"","BROSSOLETTE","MELUN"]
[262,null,null,null,null,"","BROSSOLETTE","MELUN"]
[263,null,null,null,null,"","BROSSOLETTE","MELUN"]
[264,null,null,null,null,"","BROSSOLETTE","MELUN"]
[265,null,null,null,null,"","BROSSOLETTE","MELUN"]
[266,null,null,null,null,"","BROSSOLETTE","MELUN"]
[267,null,null,null,null,"","BROSSOLETTE","MELUN"]
[268,null,null,null,null,"","BROSSOLETTE","MELUN"]
[269,null,null,null,null,"","BROSSOLETTE","MELUN"]
[270,null,null,null,null,"","BROSSOLETTE","MELUN"]
[271,null,null,null,null,"","BROSSOLETTE","MELUN"]
[272,null,null,null,null,"","BROSSOLETTE","MELUN"]
[273,null,null,null,null,"","BROSSOLETTE","MELUN"]
[274,null,null,null,null,"","BROSSOLETTE","MELUN"]
[275,null,null,null,null,"","BROSSOLETTE","MELUN"]
[276,null,null,null,null,"","BROSSOLETTE","MELUN"]
[277,null,null,null,null,"","BROSSOLETTE","MELUN"]
[278,null,null,null,null,"","BROSSOLETTE","MELUN"]
[279,null,null,null,null,"","BROSSOLETTE","MELUN"]
[280,null,null,null,null,"","BROSSOLETTE","MELUN"]
[281,null,null,null,null,"","BROSSOLETTE","MELUN"]
[282,null,null,null,null,"","BROSSOLETTE","MELUN"]
[283,null,null,null,null,"","BROSSOLETTE","MELUN"]
[284,null,null,null,null,"","BROSSOLETTE","MELUN"]
[285,null,null,null,null,"","BROSSOLETTE","MELUN"]
[286,null,null,null,null,"","BROSSOLETTE","MELUN"]
[287,null,null,null,null,"","BROSSOLETTE","MELUN"]
[288,null,null,null,null,"","BROSSOLETTE","MELUN"]
[289,null,null,null,null,"","BROSSOLETTE","MELUN"]
[290,null,null,null,null,"","BROSSOLETTE","MELUN"]
[291,null,null,null,null,"","BROSSOLETTE","MELUN"]
[292,null,null,null,null,"","BROSSOLETTE","MELUN"]
[293,null,null,null,null,"","BROSSOLETTE","MELUN"]
[294,null,null,null,null,"","BROSSOLETTE","MELUN"]
[295,null,null,null,null,"","BROSSOLETTE","MELUN"]
[296,null,null,null,null,"","BROSSOLETTE","MELUN"]
[297,null,null,null,null,"","BROSSOLETTE","MELUN"]
[298,null,null,null,null,"","BROSSOLETTE","MELUN"]
[299,null,null,null,null,"","BROSSOLETTE","MELUN"]
[300,null,null,null,null,"","BROSSOLETTE","MELUN"]
[301,"REKIK","Wissar",2004,"F","BF2","CAPUCINS","MELUN",null,null,null,"REKIK","Wissar",2004,"F"]
[302,"KAMARA","N'Mah",2005,"F","BF1","CAPUCINS","MELUN",null,null,null,"KAMARA","N'Mah",2005,"F"]
[303,"PEMBELE MANOKA","Exaucé-Junior",2001,"G","CG","CAPUCINS","MELUN",null,null,null,"PEMBELE MANOKA","Exaucé-Junior",2001,"G"]
[304,"MUNTU WA MUNGU","Vimoj",2004,"G","BG2","CAPUCINS","MELUN",null,null,null,"MUNTU WA MUNGU","Vimoj",2004,"G"]
[305,"SOULEIMANOV","Akraman",2003,"G","MG","CAPUCINS","MELUN",null,null,null,"SOULEIMANOV","Akraman",2003,"G"]
[306,"ZEGHOUDI","Hichem",2004,"G","BG2","CAPUCINS","MELUN",null,null,null,"ZEGHOUDI","Hichem",2004,"G"]
[307,"LIMA SANCAO","Schilo",2004,"G","BG2","CAPUCINS","MELUN",null,null,null,"LIMA SANCAO","Schilo",2004,"G"]
[308,"GEORGE","Heliel",2005,"G","BG1","CAPUCINS","MELUN",null,null,null,"GEORGE","Heliel",2005,"G"]
[309,"DRIES","Billel",2005,"G","BG1","CAPUCINS","MELUN",null,null,null,"DRIES","Billel",2005,"G"]
[310,"KHERBACHE","Bilal",2004,"G","BG2","CAPUCINS","MELUN",null,null,null,"KHERBACHE","Bilal",2004,"G"]
[311,"ZEGHOUDI","Noria",2003,"F","MF","CAPUCINS","MELUN",null,null,null,"ZEGHOUDI","Noria",2003,"F"]
[312,"NIZAR","Youness",2003,"G","MG","CAPUCINS","MELUN",null,null,null,"NIZAR","Youness",2003,"G"]
[313,"PALANISAMY","Cindrella",2004,"F","BF2","CAPUCINS","MELUN",null,null,null,"PALANISAMY","Cindrella",2004,"F"]
[314,"PAPIKYAN","Karen",2004,"G","BG2","CAPUCINS","MELUN",null,null,null,"PAPIKYAN","Karen",2004,"G"]
[315,"DEDE","Hunkar Kevin",2003,"G","MG","CAPUCINS","MELUN",null,null,null,"DEDE","Hunkar Kevin",2003,"G"]
[316,"PATCHIE","Klavina",2002,"F","MF","CAPUCINS","MELUN",null,null,null,"PATCHIE","Klavina",2002,"F"]
[317,"HEBERT","Léna",2005,"F","BF1","CAPUCINS","MELUN",null,null,null,"HEBERT","Léna",2005,"F"]
[318,"LELO","François",2005,"G","BG1","CAPUCINS","MELUN",null,null,null,"LELO","François",2005,"G"]
[319,"AHMED","Antoine",2005,"G","BG1","CAPUCINS","MELUN",null,null,null,"AHMED","Antoine",2005,"G"]
[320,"MENDES","Fara",2005,"G","BG1","CAPUCINS","MELUN",null,null,null,"MENDES","Fara",2005,"G"]
[321,"ARSLAN","Orkun",2005,"G",{"$f":"IF(D322=\"\",\"\",IF(E322=\"f\",LOOKUP(D322,cat_unss,cat_f),LOOKUP(D322,cat_unss,cat_g)))","v":"BG1"},"CAPUCINS","MELUN",null,null,null,"ARSLAN","Orkun",2005,"G"]
[322,"AMIMER","Zahra",2004,"F","BF2","CAPUCINS","MELUN",null,null,null,"AMIMER","Zahra",2004,"F"]
[323,"BOULERY","Lou-Ann",2002,"F","MF","CAPUCINS","MELUN",null,null,null,"BOULERY","Lou-Ann",2002,"F"]
[324,"BOULERY","Ethan",2004,"G","BG2","CAPUCINS","MELUN",null,null,null,"BOULERY","Ethan",2004,"G"]
[325,"GOMA SOUMBOU","Perrel",2002,"G","MG","CAPUCINS","MELUN",null,null,null,"GOMA SOUMBOU","Perrel",2002,"G"]
[326,"ESSONO ESSONO","Séréna",2003,"F","MF","CAPUCINS","MELUN",null,null,null,"ESSONO ESSONO","Séréna",2003,"F"]
[327,"TUTU MAYANGILA","Ryan",2005,"G","BG1","CAPUCINS","MELUN",null,null,null,"TUTU MAYANGILA","Ryan",2005,"G"]
[328,"LEBLANC","Mathéo",2001,"G","CG","CAPUCINS","MELUN",null,null,null,"LEBLANC","Mathéo",2001,"G"]
[329,"MOUSSAVOU","Lisa",2005,"F","BF1","CAPUCINS","MELUN",null,null,null,"MOUSSAVOU","Lisa",2005,"F"]
[330,"ESTEVES","Yoann",2003,"G","MG","CAPUCINS","MELUN",null,null,null,"ESTEVES","Yoann",2003,"G"]
[331,"N'DIAYE","Abdoul",2004,"G","BG2","CAPUCINS","MELUN",null,null,null,"N'DIAYE","Abdoul",2004,"G"]
[332,null,null,null,null,"","CAPUCINS","MELUN"]
[333,null,null,null,null,"","CAPUCINS","MELUN"]
[334,null,null,null,null,"","CAPUCINS","MELUN"]
[335,null,null,null,null,"","CAPUCINS","MELUN"]
[336,null,null,null,null,"","CAPUCINS","MELUN"]
[337,null,null,null,null,"","CAPUCINS","MELUN"]
[338,null,null,null,null,"","CAPUCINS","MELUN"]
[339,null,null,null,null,"","CAPUCINS","MELUN"]
[340,null,null,null,null,"","CAPUCINS","MELUN"]
[341,null,null,null,null,"","CAPUCINS","MELUN"]
[342,null,null,null,null,"","CAPUCINS","MELUN"]
[343,null,null,null,null,"","CAPUCINS","MELUN"]
[344,null,null,null,null,"","CAPUCINS","MELUN"]
[345,null,null,null,null,"","CAPUCINS","MELUN"]
[346,null,null,null,null,"","CAPUCINS","MELUN"]
[347,null,null,null,null,"","CAPUCINS","MELUN"]
[348,null,null,null,null,"","CAPUCINS","MELUN"]
[349,null,null,null,null,"","CAPUCINS","MELUN"]
[350,null,null,null,null,"","CAPUCINS","MELUN"]
[351,null,null,null,null,"","CAPUCINS","MELUN"]
[352,null,null,null,null,"","CAPUCINS","MELUN"]
[353,null,null,null,null,"","CAPUCINS","MELUN"]
[354,null,null,null,null,"","CAPUCINS","MELUN"]
[355,null,null,null,null,"","CAPUCINS","MELUN"]
[356,null,null,null,null,"","CAPUCINS","MELUN"]
[357,null,null,null,null,"","CAPUCINS","MELUN"]
[358,null,null,null,null,"","CAPUCINS","MELUN"]
[359,null,null,null,null,"","CAPUCINS","MELUN"]
[360,null,null,null,null,"","CAPUCINS","MELUN"]
[361,null,null,null,null,"","CAPUCINS","MELUN"]
[362,null,null,null,null,"","CAPUCINS","MELUN"]
[363,null,null,null,null,"","CAPUCINS","MELUN"]
[364,null,null,null,null,"","CAPUCINS","MELUN"]
[365,null,null,null,null,"","CAPUCINS","MELUN"]
[366,null,null,null,null,"","CAPUCINS","MELUN"]
[367,null,null,null,null,"","CAPUCINS","MELUN"]
[368,null,null,null,null,"","CAPUCINS","MELUN"]
[369,null,null,null,null,"","CAPUCINS","MELUN"]
[370,null,null,null,null,"","CAPUCINS","MELUN"]
[371,null,null,null,null,"","CAPUCINS","MELUN"]
[372,null,null,null,null,"","CAPUCINS","MELUN"]
[373,null,null,null,null,"","CAPUCINS","MELUN"]
[374,null,null,null,null,"","CAPUCINS","MELUN"]
[375,null,null,null,null,"","CAPUCINS","MELUN"]
[376,null,null,null,null,"","CAPUCINS","MELUN"]
[377,null,null,null,null,"","CAPUCINS","MELUN"]
[378,null,null,null,null,"","CAPUCINS","MELUN"]
[379,null,null,null,null,"","CAPUCINS","MELUN"]
[380,null,null,null,null,"","CAPUCINS","MELUN"]
[381,null,null,null,null,"","CAPUCINS","MELUN"]
[382,null,null,null,null,"","CAPUCINS","MELUN"]
[383,null,null,null,null,"","CAPUCINS","MELUN"]
[384,null,null,null,null,"","CAPUCINS","MELUN"]
[385,null,null,null,null,{"$f":"IF(D386=\"\",\"\",IF(E386=\"f\",LOOKUP(D386,cat_unss,cat_f),LOOKUP(D386,cat_unss,cat_g)))","v":""},"CAPUCINS","MELUN"]
[386,null,null,null,null,"","CAPUCINS","MELUN"]
[387,null,null,null,null,"","CAPUCINS","MELUN"]
[388,null,null,null,null,"","CAPUCINS","MELUN"]
[389,null,null,null,null,"","CAPUCINS","MELUN"]
[390,null,null,null,null,"","CAPUCINS","MELUN"]
[391,null,null,null,null,"","CAPUCINS","MELUN"]
[392,null,null,null,null,"","CAPUCINS","MELUN"]
[393,null,null,null,null,"","CAPUCINS","MELUN"]
[394,null,null,null,null,"","CAPUCINS","MELUN"]
[395,null,null,null,null,"","CAPUCINS","MELUN"]
[396,null,null,null,null,"","CAPUCINS","MELUN"]
[397,null,null,null,null,"","CAPUCINS","MELUN"]
[398,null,null,null,null,"","CAPUCINS","MELUN"]
[399,null,null,null,null,"","CAPUCINS","MELUN"]
[400,null,null,null,null,"","CAPUCINS","MELUN"]
[401,null,null,null,null,"","CAPUCINS","MELUN"]
[402,null,null,null,null,"","CAPUCINS","MELUN"]
[403,null,null,null,null,"","CAPUCINS","MELUN"]
[404,null,null,null,null,"","CAPUCINS","MELUN"]
[405,null,null,null,null,"","CAPUCINS","MELUN"]
[406,null,null,null,null,"","CAPUCINS","MELUN"]
[407,null,null,null,null,"","CAPUCINS","MELUN"]
[408,null,null,null,null,"","CAPUCINS","MELUN"]
[409,null,null,null,null,"","CAPUCINS","MELUN"]
[410,null,null,null,null,"","CAPUCINS","MELUN"]
[411,null,null,null,null,"","CAPUCINS","MELUN"]
[412,null,null,null,null,"","CAPUCINS","MELUN"]
[413,null,null,null,null,"","CAPUCINS","MELUN"]
[414,null,null,null,null,"","CAPUCINS","MELUN"]
[415,null,null,null,null,"","CAPUCINS","MELUN"]
[416,null,null,null,null,"","CAPUCINS","MELUN"]
[417,null,null,null,null,"","CAPUCINS","MELUN"]
[418,null,null,null,null,"","CAPUCINS","MELUN"]
[419,null,null,null,null,"","CAPUCINS","MELUN"]
[420,null,null,null,null,"","CAPUCINS","MELUN"]
[421,null,null,null,null,"","CAPUCINS","MELUN"]
[422,null,null,null,null,"","CAPUCINS","MELUN"]
[423,null,null,null,null,"","CAPUCINS","MELUN"]
[424,null,null,null,null,"","CAPUCINS","MELUN"]
[425,null,null,null,null,"","CAPUCINS","MELUN"]
[426,null,null,null,null,"","CAPUCINS","MELUN"]
[427,null,null,null,null,"","CAPUCINS","MELUN"]
[428,null,null,null,null,"","CAPUCINS","MELUN"]
[429,null,null,null,null,"","CAPUCINS","MELUN"]
[430,null,null,null,null,"","CAPUCINS","MELUN"]
[431,null,null,null,null,"","CAPUCINS","MELUN"]
[432,null,null,null,null,"","CAPUCINS","MELUN"]
[433,null,null,null,null,"","CAPUCINS","MELUN"]
[434,null,null,null,null,"","CAPUCINS","MELUN"]
[435,null,null,null,null,"","CAPUCINS","MELUN"]
[436,null,null,null,null,"","CAPUCINS","MELUN"]
[437,null,null,null,null,"","CAPUCINS","MELUN"]
[438,null,null,null,null,"","CAPUCINS","MELUN"]
[439,null,null,null,null,"","CAPUCINS","MELUN"]
[440,null,null,null,null,"","CAPUCINS","MELUN"]
[441,null,null,null,null,"","CAPUCINS","MELUN"]
[442,null,null,null,null,"","CAPUCINS","MELUN"]
[443,null,null,null,null,"","CAPUCINS","MELUN"]
[444,null,null,null,null,"","CAPUCINS","MELUN"]
[445,null,null,null,null,"","CAPUCINS","MELUN"]
[446,null,null,null,null,"","CAPUCINS","MELUN"]
[447,null,null,null,null,"","CAPUCINS","MELUN"]
[448,null,null,null,null,"","CAPUCINS","MELUN"]
[449,null,null,null,null,{"$f":"IF(D450=\"\",\"\",IF(E450=\"f\",LOOKUP(D450,cat_unss,cat_f),LOOKUP(D450,cat_unss,cat_g)))","v":""},"CAPUCINS","MELUN"]
[450,null,null,null,null,"","CAPUCINS","MELUN"]
[451,null,null,null,null,"","CAPUCINS","MELUN"]
[452,null,null,null,null,"","CAPUCINS","MELUN"]
[453,null,null,null,null,"","CAPUCINS","MELUN"]
[454,null,null,null,null,"","CAPUCINS","MELUN"]
[455,null,null,null,null,"","CAPUCINS","MELUN"]
[456,null,null,null,null,"","CAPUCINS","MELUN"]
[457,null,null,null,null,"","CAPUCINS","MELUN"]
[458,null,null,null,null,"","CAPUCINS","MELUN"]
[459,null,null,null,null,"","CAPUCINS","MELUN"]
[460,null,null,null,null,"","CAPUCINS","MELUN"]
[461,null,null,null,null,"","CAPUCINS","MELUN"]
[462,null,null,null,null,"","CAPUCINS","MELUN"]
[463,null,null,null,null,"","CAPUCINS","MELUN"]
[464,null,null,null,null,"","CAPUCINS","MELUN"]
[465,null,null,null,null,"","CAPUCINS","MELUN"]
[466,null,null,null,null,"","CAPUCINS","MELUN"]
[467,null,null,null,null,"","CAPUCINS","MELUN"]
[468,null,null,null,null,"","CAPUCINS","MELUN"]
[469,null,null,null,null,"","CAPUCINS","MELUN"]
[470,null,null,null,null,"","CAPUCINS","MELUN"]
[471,null,null,null,null,"","CAPUCINS","MELUN"]
[472,null,null,null,null,"","CAPUCINS","MELUN"]
[473,null,null,null,null,"","CAPUCINS","MELUN"]
[474,null,null,null,null,"","CAPUCINS","MELUN"]
[475,null,null,null,null,"","CAPUCINS","MELUN"]
[476,null,null,null,null,"","CAPUCINS","MELUN"]
[477,null,null,null,null,"","CAPUCINS","MELUN"]
[478,null,null,null,null,"","CAPUCINS","MELUN"]
[479,null,null,null,null,"","CAPUCINS","MELUN"]
[480,null,null,null,null,"","CAPUCINS","MELUN"]
[481,null,null,null,null,"","CAPUCINS","MELUN"]
[482,null,null,null,null,"","CAPUCINS","MELUN"]
[483,null,null,null,null,"","CAPUCINS","MELUN"]
[484,null,null,null,null,"","CAPUCINS","MELUN"]
[485,null,null,null,null,"","CAPUCINS","MELUN"]
[486,null,null,null,null,"","CAPUCINS","MELUN"]
[487,null,null,null,null,"","CAPUCINS","MELUN"]
[488,null,null,null,null,"","CAPUCINS","MELUN"]
[489,null,null,null,null,"","CAPUCINS","MELUN"]
[490,null,null,null,null,"","CAPUCINS","MELUN"]
[491,null,null,null,null,"","CAPUCINS","MELUN"]
[492,null,null,null,null,"","CAPUCINS","MELUN"]
[493,null,null,null,null,"","CAPUCINS","MELUN"]
[494,null,null,null,null,"","CAPUCINS","MELUN"]
[495,null,null,null,null,"","CAPUCINS","MELUN"]
[496,null,null,null,null,"","CAPUCINS","MELUN"]
[497,null,null,null,null,"","CAPUCINS","MELUN"]
[498,null,null,null,null,"","CAPUCINS","MELUN"]
[499,null,null,null,null,"","CAPUCINS","MELUN"]
[500,null,null,null,null,"","CAPUCINS","MELUN"]
[501,null,null,null,null,"","CAPUCINS","MELUN"]
[502,null,null,null,null,"","CAPUCINS","MELUN"]
[503,null,null,null,null,"","CAPUCINS","MELUN"]
[504,null,null,null,null,"","CAPUCINS","MELUN"]
[505,null,null,null,null,"","CAPUCINS","MELUN"]
[506,null,null,null,null,"","CAPUCINS","MELUN"]
[507,null,null,null,null,"","CAPUCINS","MELUN"]
[508,null,null,null,null,"","CAPUCINS","MELUN"]
[509,null,null,null,null,"","CAPUCINS","MELUN"]
[510,null,null,null,null,"","CAPUCINS","MELUN"]
[511,null,null,null,null,"","CAPUCINS","MELUN"]
[512,null,null,null,null,"","CAPUCINS","MELUN"]
[513,null,null,null,null,{"$f":"IF(D514=\"\",\"\",IF(E514=\"f\",LOOKUP(D514,cat_unss,cat_f),LOOKUP(D514,cat_unss,cat_g)))","v":""},"CAPUCINS","MELUN"]
[514,null,null,null,null,"","CAPUCINS","MELUN"]
[515,null,null,null,null,"","CAPUCINS","MELUN"]
[516,null,null,null,null,"","CAPUCINS","MELUN"]
[517,null,null,null,null,"","CAPUCINS","MELUN"]
[518,null,null,null,null,"","CAPUCINS","MELUN"]
[519,null,null,null,null,"","CAPUCINS","MELUN"]
[520,null,null,null,null,"","CAPUCINS","MELUN"]
[521,null,null,null,null,"","CAPUCINS","MELUN"]
[522,null,null,null,null,"","CAPUCINS","MELUN"]
[523,null,null,null,null,"","CAPUCINS","MELUN"]
[524,null,null,null,null,"","CAPUCINS","MELUN"]
[525,null,null,null,null,"","CAPUCINS","MELUN"]
[526,null,null,null,null,"","CAPUCINS","MELUN"]
[527,null,null,null,null,"","CAPUCINS","MELUN"]
[528,null,null,null,null,"","CAPUCINS","MELUN"]
[529,null,null,null,null,"","CAPUCINS","MELUN"]
[530,null,null,null,null,"","CAPUCINS","MELUN"]
[531,null,null,null,null,"","CAPUCINS","MELUN"]
[532,null,null,null,null,"","CAPUCINS","MELUN"]
[533,null,null,null,null,"","CAPUCINS","MELUN"]
[534,null,null,null,null,"","CAPUCINS","MELUN"]
[535,null,null,null,null,"","CAPUCINS","MELUN"]
[536,null,null,null,null,"","CAPUCINS","MELUN"]
[537,null,null,null,null,"","CAPUCINS","MELUN"]
[538,null,null,null,null,"","CAPUCINS","MELUN"]
[539,null,null,null,null,"","CAPUCINS","MELUN"]
[540,null,null,null,null,"","CAPUCINS","MELUN"]
[541,null,null,null,null,"","CAPUCINS","MELUN"]
[542,null,null,null,null,"","CAPUCINS","MELUN"]
[543,null,null,null,null,"","CAPUCINS","MELUN"]
[544,null,null,null,null,"","CAPUCINS","MELUN"]
[545,null,null,null,null,"","CAPUCINS","MELUN"]
[546,null,null,null,null,"","CAPUCINS","MELUN"]
[547,null,null,null,null,"","CAPUCINS","MELUN"]
[548,null,null,null,null,"","CAPUCINS","MELUN"]
[549,null,null,null,null,"","CAPUCINS","MELUN"]
[550,null,null,null,null,"","CAPUCINS","MELUN"]
[551,null,null,null,null,"","CAPUCINS","MELUN"]
[552,null,null,null,null,"","CAPUCINS","MELUN"]
[553,null,null,null,null,"","CAPUCINS","MELUN"]
[554,null,null,null,null,"","CAPUCINS","MELUN"]
[555,null,null,null,null,"","CAPUCINS","MELUN"]
[556,null,null,null,null,"","CAPUCINS","MELUN"]
[557,null,null,null,null,"","CAPUCINS","MELUN"]
[558,null,null,null,null,"","CAPUCINS","MELUN"]
[559,null,null,null,null,"","CAPUCINS","MELUN"]
[560,null,null,null,null,"","CAPUCINS","MELUN"]
[561,null,null,null,null,"","CAPUCINS","MELUN"]
[562,null,null,null,null,"","CAPUCINS","MELUN"]
[563,null,null,null,null,"","CAPUCINS","MELUN"]
[564,null,null,null,null,"","CAPUCINS","MELUN"]
[565,null,null,null,null,"","CAPUCINS","MELUN"]
[566,null,null,null,null,"","CAPUCINS","MELUN"]
[567,null,null,null,null,"","CAPUCINS","MELUN"]
[568,null,null,null,null,"","CAPUCINS","MELUN"]
[569,null,null,null,null,"","CAPUCINS","MELUN"]
[570,null,null,null,null,"","CAPUCINS","MELUN"]
[571,null,null,null,null,"","CAPUCINS","MELUN"]
[572,null,null,null,null,"","CAPUCINS","MELUN"]
[573,null,null,null,null,"","CAPUCINS","MELUN"]
[574,null,null,null,null,"","CAPUCINS","MELUN"]
[575,null,null,null,null,"","CAPUCINS","MELUN"]
[576,null,null,null,null,"","CAPUCINS","MELUN"]
[577,null,null,null,null,{"$f":"IF(D578=\"\",\"\",IF(E578=\"f\",LOOKUP(D578,cat_unss,cat_f),LOOKUP(D578,cat_unss,cat_g)))","v":""},"CAPUCINS","MELUN"]
[578,null,null,null,null,"","CAPUCINS","MELUN"]
[579,null,null,null,null,"","CAPUCINS","MELUN"]
[580,null,null,null,null,"","CAPUCINS","MELUN"]
[581,null,null,null,null,"","CAPUCINS","MELUN"]
[582,null,null,null,null,"","CAPUCINS","MELUN"]
[583,null,null,null,null,"","CAPUCINS","MELUN"]
[584,null,null,null,null,"","CAPUCINS","MELUN"]
[585,null,null,null,null,"","CAPUCINS","MELUN"]
[586,null,null,null,null,"","CAPUCINS","MELUN"]
[587,null,null,null,null,"","CAPUCINS","MELUN"]
[588,null,null,null,null,"","CAPUCINS","MELUN"]
[589,null,null,null,null,"","CAPUCINS","MELUN"]
[590,null,null,null,null,"","CAPUCINS","MELUN"]
[591,null,null,null,null,"","CAPUCINS","MELUN"]
[592,null,null,null,null,"","CAPUCINS","MELUN"]
[593,null,null,null,null,"","CAPUCINS","MELUN"]
[594,null,null,null,null,"","CAPUCINS","MELUN"]
[595,null,null,null,null,"","CAPUCINS","MELUN"]
[596,null,null,null,null,"","CAPUCINS","MELUN"]
[597,null,null,null,null,"","CAPUCINS","MELUN"]
[598,null,null,null,null,"","CAPUCINS","MELUN"]
[599,null,null,null,null,"","CAPUCINS","MELUN"]
[600,null,null,null,null,"","CAPUCINS","MELUN"]
[601,"ABDEN","Enzo",2003,"G","MG","CH PEGUY","VERNEUIL"]
[602,"KASTELLER","Corentin",2003,"G","MG","CH PEGUY","VERNEUIL"]
[603,"PINON","Louis",2003,"G","MG","CH PEGUY","VERNEUIL"]
[604,"BELARBI","Kenzi",2003,"G","MG","CH PEGUY","VERNEUIL"]
[605,"MARTINEZ","Noan",2003,"G","MG","CH PEGUY","VERNEUIL"]
[606,"BAUWENS","Mathys",2004,"G","BG2","CH PEGUY","VERNEUIL"]
[607,"CORIOLLES","Kylian",2003,"G","MG","CH PEGUY","VERNEUIL"]
[608,"DAMAS","Mathieu",2003,"G","MG","CH PEGUY","VERNEUIL"]
[609,"BECHARD","Mattéo",2003,"G","MG","CH PEGUY","VERNEUIL"]
[610,"BOISARD","Adrien",2003,"G","MG","CH PEGUY","VERNEUIL"]
[611,"OSMAINE","Ronald",2003,"G","MG","CH PEGUY","VERNEUIL"]
[612,"DAMAS","Vincent",2003,"G","MG","CH PEGUY","VERNEUIL"]
[613,"VOISIN","Kellian",2003,"G","MG","CH PEGUY","VERNEUIL"]
[614,"CORIOLLES","Nathan",2003,"G","MG","CH PEGUY","VERNEUIL"]
[615,"VERMES","Arthur",2003,"G","MG","CH PEGUY","VERNEUIL"]
[616,"LE BERRE","Hugo",2003,"G","MG","CH PEGUY","VERNEUIL"]
[617,"VERNOIS","Oscar",2003,"G","MG","CH PEGUY","VERNEUIL"]
[618,"MARQUES DA COSTA","Joao",2003,"G","MG","CH PEGUY","VERNEUIL"]
[619,"SOUSA MATIAS","Cesar",2003,"G","MG","CH PEGUY","VERNEUIL"]
[620,"GUNTZBURGER","Timothé",2003,"G","MG","CH PEGUY","VERNEUIL"]
[621,"MICHAUD","Manon",2003,"F","MF","CH PEGUY","VERNEUIL"]
[622,"CHAVES","Marie",2003,"F","MF","CH PEGUY","VERNEUIL"]
[623,"FERGUI","Yona",2003,"F","MF","CH PEGUY","VERNEUIL"]
[624,"ROULY","Alicia",2003,"F","MF","CH PEGUY","VERNEUIL"]
[625,"JOUAULT","Victoire",2003,"F","MF","CH PEGUY","VERNEUIL"]
[626,"ETHORE","Manon",2003,"F","MF","CH PEGUY","VERNEUIL"]
[627,"HERMAN","Nikita",2003,"F","MF","CH PEGUY","VERNEUIL"]
[628,"CRESTO","Margot",2003,"F","MF","CH PEGUY","VERNEUIL"]
[629,"POMART","Eugénie",2003,"F","MF","CH PEGUY","VERNEUIL"]
[630,"HARDY","Noémie",2003,"F","MF","CH PEGUY","VERNEUIL"]
[631,"DUVERNE","Camille",2003,"F","MF","CH PEGUY","VERNEUIL"]
[632,"MICAELI","Oceane",2003,"F","MF","CH PEGUY","VERNEUIL"]
[633,"BOIVIN","Coralie",2003,"F","MF","CH PEGUY","VERNEUIL"]
[634,"DELCAME","Lunna",2003,"F","MF","CH PEGUY","VERNEUIL"]
[635,"VERNOIS","Nina",2004,"F","BF2","CH PEGUY","VERNEUIL"]
[636,"FONSECA","Morine",2003,"F","MF","CH PEGUY","VERNEUIL"]
[637,"JOYEZ","Ambre",2003,"F","MF","CH PEGUY","VERNEUIL"]
[638,"KUHN","Justine",2003,"F","MF","CH PEGUY","VERNEUIL"]
[639,"DUDEK","Chloe",2003,"F","MF","CH PEGUY","VERNEUIL"]
[640,"LE PRAEL","Léa",2003,"F","MF","CH PEGUY","VERNEUIL"]
[641,"MIGNOT","Clément",2002,"G",{"$f":"IF(D642=\"\",\"\",IF(E642=\"f\",LOOKUP(D642,cat_unss,cat_f),LOOKUP(D642,cat_unss,cat_g)))","v":"MG"},"CH PEGUY","VERNEUIL"]
[642,"BOUCLY","Clément",2002,"G","MG","CH PEGUY","VERNEUIL"]
[643,"HAPDEY","Antoine",2002,"G","MG","CH PEGUY","VERNEUIL"]
[644,"JUY","Duncan",2002,"G","MG","CH PEGUY","VERNEUIL"]
[645,"DE SOUSA","Nicolas",2002,"G","MG","CH PEGUY","VERNEUIL"]
[646,"GERARD","Victor",2002,"G","MG","CH PEGUY","VERNEUIL"]
[647,"RENARD","Tom",2002,"G","MG","CH PEGUY","VERNEUIL"]
[648,"TANNEUR","Alexy",2002,"G","MG","CH PEGUY","VERNEUIL"]
[649,"JANNIC","Camille",2002,"G","MG","CH PEGUY","VERNEUIL"]
[650,"JAGOZ","Brendan",2001,"G","CG","CH PEGUY","VERNEUIL"]
[651,"HEYDT","Antonin",2002,"G","MG","CH PEGUY","VERNEUIL"]
[652,"BILLOT-MORNET","Vincent",2002,"G","MG","CH PEGUY","VERNEUIL"]
[653,"DA CRUZ","Mateo",2002,"G","MG","CH PEGUY","VERNEUIL"]
[654,"AZAIS","Teilo",2002,"G","MG","CH PEGUY","VERNEUIL"]
[655,"RAGNARD","Vincent",2002,"G","MG","CH PEGUY","VERNEUIL"]
[656,"DEMARTIN","Killian",2002,"G","MG","CH PEGUY","VERNEUIL"]
[657,"DESLANDES","Quentin",2002,"G","MG","CH PEGUY","VERNEUIL"]
[658,"LAFON","Kylian",2002,"G","MG","CH PEGUY","VERNEUIL"]
[659,"DREANO","Thibault",2002,"G","MG","CH PEGUY","VERNEUIL"]
[660,"FAGET","Alexis",2002,"G","MG","CH PEGUY","VERNEUIL"]
[661,"NOM","Prénom",2002,"F","MF","CH PEGUY","VERNEUIL"]
[662,"LAIGLE","Héloïse",2002,"F","MF","CH PEGUY","VERNEUIL"]
[663,"BARDOCHAN","Vanessa",2002,"F","MF","CH PEGUY","VERNEUIL"]
[664,"DESCHAMPS","Emma",2002,"F","MF","CH PEGUY","VERNEUIL"]
[665,"LABAILLE","Laurie",2002,"F","MF","CH PEGUY","VERNEUIL"]
[666,"SINDEZINGUE","Marie",2002,"F","MF","CH PEGUY","VERNEUIL"]
[667,"HOURDEAU","Maëlie",2002,"F","MF","CH PEGUY","VERNEUIL"]
[668,"CIGNOLIN","Chloé",2002,"F","MF","CH PEGUY","VERNEUIL"]
[669,"AZEMI","Blinera",2002,"F","MF","CH PEGUY","VERNEUIL"]
[670,"ARCAS","Melina",2002,"F","MF","CH PEGUY","VERNEUIL"]
[671,"HAREL","Marie",2002,"F","MF","CH PEGUY","VERNEUIL"]
[672,"CASIMIRIUS","Janna",2002,"F","MF","CH PEGUY","VERNEUIL"]
[673,"PILAS","Léa",2002,"F","MF","CH PEGUY","VERNEUIL"]
[674,"HUBIERE","Tifaine",2002,"F","MF","CH PEGUY","VERNEUIL"]
[675,"LOVERA","Pauline",2002,"F","MF","CH PEGUY","VERNEUIL"]
[676,"GALLEGO","Lea",2002,"F","MF","CH PEGUY","VERNEUIL"]
[677,"LEONARD","Maeve",2002,"F","MF","CH PEGUY","VERNEUIL"]
[678,"MARQUES","Cassandra",2004,"F","BF2","CH PEGUY","VERNEUIL"]
[679,"PHILIPPE","Clara",2004,"F","BF2","CH PEGUY","VERNEUIL"]
[680,"LIGNAC","Juliette",2004,"F","BF2","CH PEGUY","VERNEUIL"]
[681,"LABAILLE","Cloé",2004,"F","BF2","CH PEGUY","VERNEUIL"]
[682,"DELALANDE","Charline",2004,"F","BF2","CH PEGUY","VERNEUIL"]
[683,"GEOFFROY","Ambre",2004,"F","BF2","CH PEGUY","VERNEUIL"]
[684,"TILLARD","Aude",2004,"F","BF2","CH PEGUY","VERNEUIL"]
[685,"KAVUESO","Lorena",2004,"F","BF2","CH PEGUY","VERNEUIL"]
[686,"SEJOR-PRINET","Paloma",2004,"F","BF2","CH PEGUY","VERNEUIL"]
[687,"TILLARD","Emma",2004,"F","BF2","CH PEGUY","VERNEUIL"]
[688,"BERNARDO","Sarah",2004,"F","BF2","CH PEGUY","VERNEUIL"]
[689,"JELONEK","Lou",2004,"F","BF2","CH PEGUY","VERNEUIL"]
[690,"BELARBI","Hazar-Zakia",2004,"F","BF2","CH PEGUY","VERNEUIL"]
[691,"CHATELAIS","Maëlle",2004,"F","BF2","CH PEGUY","VERNEUIL"]
[692,"JOVE","Emily",2004,"F","BF2","CH PEGUY","VERNEUIL"]
[693,"BAERT","Rose",2004,"F","BF2","CH PEGUY","VERNEUIL"]
[694,"BILLIAU","Liliane",2004,"F","BF2","CH PEGUY","VERNEUIL"]
[695,"RUTKOWSKI","Léa",2004,"F","BF2","CH PEGUY","VERNEUIL"]
[696,"JACQUEMIN","Auriane",2003,"F","MF","CH PEGUY","VERNEUIL"]
[697,"VIEIRA","Abigaelle",2004,"F","BF2","CH PEGUY","VERNEUIL"]
[698,"KUNH DE CHIZELLE","MARIE",2004,"F","BF2","CH PEGUY","VERNEUIL"]
[699,"REMACLE","LISA",2004,"F","BF2","CH PEGUY","VERNEUIL"]
[700,"OBRIOT","Enzo",2004,"G","BG2","CH PEGUY","VERNEUIL"]
[701,"ABAZI","Olti",2003,"G","MG","CH PEGUY","VERNEUIL"]
[702,"DUSSUEL","Bastien",2004,"G","BG2","CH PEGUY","VERNEUIL"]
[703,"TEISSIERE","Yann",2003,"G","MG","CH PEGUY","VERNEUIL"]
[704,"CANTAREL","Emilio",2004,"G","BG2","CH PEGUY","VERNEUIL"]
[705,"DOS-REIS","Matteo",2004,"G",{"$f":"IF(D706=\"\",\"\",IF(E706=\"f\",LOOKUP(D706,cat_unss,cat_f),LOOKUP(D706,cat_unss,cat_g)))","v":"BG2"},"CH PEGUY","VERNEUIL"]
[706,"SIMON","Titouan",2004,"G","BG2","CH PEGUY","VERNEUIL"]
[707,"PERILLIER","Hugo",2003,"G","MG","CH PEGUY","VERNEUIL"]
[708,"DONNER","Alan",2003,"G","MG","CH PEGUY","VERNEUIL"]
[709,"PAUL","Kensley",2004,"G","BG2","CH PEGUY","VERNEUIL"]
[710,"GAULARD","Clément",2004,"G","BG2","CH PEGUY","VERNEUIL"]
[711,"JOYEZ","Robin",2004,"G","BG2","CH PEGUY","VERNEUIL"]
[712,"SIMONET","Mathis",2004,"G","BG2","CH PEGUY","VERNEUIL"]
[713,"MAMOADE","Jean Louis",2004,"G","BG2","CH PEGUY","VERNEUIL"]
[714,"LIMEA","Ocean",2003,"G","MG","CH PEGUY","VERNEUIL"]
[715,"BOISARD","Nicolas",2004,"G","BG2","CH PEGUY","VERNEUIL"]
[716,"LAUNAY","Mathéo",2004,"G","BG2","CH PEGUY","VERNEUIL"]
[717,"BEAURAIN","Thomas",2004,"G","BG2","CH PEGUY","VERNEUIL"]
[718,"DESPREZ","Adrien",2004,"G","BG2","CH PEGUY","VERNEUIL"]
[719,"CASCARINO","Tony",2004,"G","BG2","CH PEGUY","VERNEUIL"]
[720,"JULIARD","Julien",2004,"G","BG2","CH PEGUY","VERNEUIL"]
[721,"MICHAUD","Maelle",2005,"F","BF1","CH PEGUY","VERNEUIL"]
[722,"SOUSA MENDES","Luana",2005,"F","BF1","CH PEGUY","VERNEUIL"]
[723,"ARCAS","Julia",2005,"F","BF1","CH PEGUY","VERNEUIL"]
[724,"SWIDERSKI","Juliette",2005,"F","BF1","CH PEGUY","VERNEUIL"]
[725,"RENARD","Lola",2005,"F","BF1","CH PEGUY","VERNEUIL"]
[726,"BELOTTI","Georgia",2005,"F","BF1","CH PEGUY","VERNEUIL"]
[727,"SINDEZINGUE","Isabelle",2005,"F","BF1","CH PEGUY","VERNEUIL"]
[728,"PETIT","Laura",2005,"F","BF1","CH PEGUY","VERNEUIL"]
[729,"LIEPPE","Manon",2005,"F","BF1","CH PEGUY","VERNEUIL"]
[730,"DELHAYE","Louna",2005,"F","BF1","CH PEGUY","VERNEUIL"]
[731,"BERTHOL","Laury",2005,"F","BF1","CH PEGUY","VERNEUIL"]
[732,"MÜLLER","Maëliss",2005,"F","BF1","CH PEGUY","VERNEUIL"]
[733,"GIRBAL","Nolina",2005,"F","BF1","CH PEGUY","VERNEUIL"]
[734,"PLANQUETTE","Lisa",2005,"F","BF1","CH PEGUY","VERNEUIL"]
[735,"MARIA","Clara",2005,"F","BF1","CH PEGUY","VERNEUIL"]
[736,"JUY","Marion",2005,"F","BF1","CH PEGUY","VERNEUIL"]
[737,"HUGUENY","Eloise",2005,"F","BF1","CH PEGUY","VERNEUIL"]
[738,"ROBERTO","Andrea",2005,"F","BF1","CH PEGUY","VERNEUIL"]
[739,"BLAES","Justine",2005,"F","BF1","CH PEGUY","VERNEUIL"]
[740,"PICHON","Eva",2005,"F","BF1","CH PEGUY","VERNEUIL"]
[741,"TCHAMBA NYA","Maelys",2005,"F","BF1","CH PEGUY","VERNEUIL"]
[742,"BELLO","Romain",2005,"G","BG1","CH PEGUY","VERNEUIL"]
[743,"DE SOUSA BORGES","Nathan",2005,"G","BG1","CH PEGUY","VERNEUIL"]
[744,"DELALANDE","Gabriel",2005,"G","BG1","CH PEGUY","VERNEUIL"]
[745,"DE SOUSA BORGES","Matheo",2005,"G","BG1","CH PEGUY","VERNEUIL"]
[746,"MARTINEZ","Téo",2005,"G","BG1","CH PEGUY","VERNEUIL"]
[747,"MORISSET","Romain",2005,"G","BG1","CH PEGUY","VERNEUIL"]
[748,"MONGE","Xavier",2005,"G","BG1","CH PEGUY","VERNEUIL"]
[749,"LE PRAEL","Lucas",2005,"G","BG1","CH PEGUY","VERNEUIL"]
[750,"EL-KRID","Issam",2005,"G","BG1","CH PEGUY","VERNEUIL"]
[751,"BERGER","Gregory",2005,"G","BG1","CH PEGUY","VERNEUIL"]
[752,"ROKS-BERNARD","Alexis",2005,"G","BG1","CH PEGUY","VERNEUIL"]
[753,"HAMMATI","Rayyane",2005,"G","BG1","CH PEGUY","VERNEUIL"]
[754,"MASSIN","Maxence",2005,"G","BG1","CH PEGUY","VERNEUIL"]
[755,"THAMI","Manoa",2005,"G","BG1","CH PEGUY","VERNEUIL"]
[756,"LEMAIRE","Enzo",2005,"G","BG1","CH PEGUY","VERNEUIL"]
[757,"VILLENEUVE","Alexis",2005,"G","BG1","CH PEGUY","VERNEUIL"]
[758,"CORNANO","Mathias",2005,"G","BG1","CH PEGUY","VERNEUIL"]
[759,"COQUELIN","Jeremy",2005,"G","BG1","CH PEGUY","VERNEUIL"]
[760,"ABREU","Lorenzo",2005,"G","BG1","CH PEGUY","VERNEUIL"]
[761,"PELLARD","Alexandre",2005,"G","BG1","CH PEGUY","VERNEUIL"]
[762,"FERREIRA-SIMAO","Baptiste",2005,"G","BG1","CH PEGUY","VERNEUIL"]
[763,null,null,null,null,"","CH PEGUY","VERNEUIL"]
[764,"QUEMADO","JULIE",2002,"F","MF","CH PEGUY","VERNEUIL"]
[765,"CLOAREC","HANNAH",2002,"F","MF","CH PEGUY","VERNEUIL"]
[766,null,null,null,null,"","CH PEGUY","VERNEUIL"]
[767,null,null,null,null,"","CH PEGUY","VERNEUIL"]
[768,null,null,null,null,"","CH PEGUY","VERNEUIL"]
[769,null,null,null,null,{"$f":"IF(D770=\"\",\"\",IF(E770=\"f\",LOOKUP(D770,cat_unss,cat_f),LOOKUP(D770,cat_unss,cat_g)))","v":""},"CH PEGUY","VERNEUIL"]
[770,null,null,null,null,"","CH PEGUY","VERNEUIL"]
[771,null,null,null,null,"","CH PEGUY","VERNEUIL"]
[772,null,null,null,null,"","CH PEGUY","VERNEUIL"]
[773,null,null,null,null,"","CH PEGUY","VERNEUIL"]
[774,null,null,null,null,"","CH PEGUY","VERNEUIL"]
[775,null,null,null,null,"","CH PEGUY","VERNEUIL"]
[776,null,null,null,null,"","CH PEGUY","VERNEUIL"]
[777,null,null,null,null,"","CH PEGUY","VERNEUIL"]
[778,null,null,null,null,"","CH PEGUY","VERNEUIL"]
[779,null,null,null,null,"","CH PEGUY","VERNEUIL"]
[780,null,null,null,null,"","CH PEGUY","VERNEUIL"]
[781,null,null,null,null,"","CH PEGUY","VERNEUIL"]
[782,null,null,null,null,"","CH PEGUY","VERNEUIL"]
[783,null,null,null,null,"","CH PEGUY","VERNEUIL"]
[784,null,null,null,null,"","CH PEGUY","VERNEUIL"]
[785,null,null,null,null,"","CH PEGUY","VERNEUIL"]
[786,null,null,null,null,"","CH PEGUY","VERNEUIL"]
[787,null,null,null,null,"","CH PEGUY","VERNEUIL"]
[788,null,null,null,null,"","CH PEGUY","VERNEUIL"]
[789,null,null,null,null,"","CH PEGUY","VERNEUIL"]
[790,null,null,null,null,"","CH PEGUY","VERNEUIL"]
[791,null,null,null,null,"","CH PEGUY","VERNEUIL"]
[792,null,null,null,null,"","CH PEGUY","VERNEUIL"]
[793,null,null,null,null,"","CH PEGUY","VERNEUIL"]
[794,null,null,null,null,"","CH PEGUY","VERNEUIL"]
[795,null,null,null,null,"","CH PEGUY","VERNEUIL"]
[796,null,null,null,null,"","CH PEGUY","VERNEUIL"]
[797,null,null,null,null,"","CH PEGUY","VERNEUIL"]
[798,null,null,null,null,"","CH PEGUY","VERNEUIL"]
[799,null,null,null,null,"","CH PEGUY","VERNEUIL"]
[800,null,null,null,null,"","CH PEGUY","VERNEUIL"]
[801,null,null,null,null,"","CH PEGUY","VERNEUIL"]
[802,null,null,null,null,"","CH PEGUY","VERNEUIL"]
[803,null,null,null,null,"","CH PEGUY","VERNEUIL"]
[804,null,null,null,null,"","CH PEGUY","VERNEUIL"]
[805,null,null,null,null,"","CH PEGUY","VERNEUIL"]
[806,null,null,null,null,"","CH PEGUY","VERNEUIL"]
[807,null,null,null,null,"","CH PEGUY","VERNEUIL"]
[808,null,null,null,null,"","CH PEGUY","VERNEUIL"]
[809,null,null,null,null,"","CH PEGUY","VERNEUIL"]
[810,null,null,null,null,"","CH PEGUY","VERNEUIL"]
[811,null,null,null,null,"","CH PEGUY","VERNEUIL"]
[812,null,null,null,null,"","CH PEGUY","VERNEUIL"]
[813,null,null,null,null,"","CH PEGUY","VERNEUIL"]
[814,null,null,null,null,"","CH PEGUY","VERNEUIL"]
[815,null,null,null,null,"","CH PEGUY","VERNEUIL"]
[816,null,null,null,null,"","CH PEGUY","VERNEUIL"]
[817,null,null,null,null,"","CH PEGUY","VERNEUIL"]
[818,null,null,null,null,"","CH PEGUY","VERNEUIL"]
[819,null,null,null,null,"","CH PEGUY","VERNEUIL"]
[820,null,null,null,null,"","CH PEGUY","VERNEUIL"]
[821,null,null,null,null,"","CH PEGUY","VERNEUIL"]
[822,null,null,null,null,"","CH PEGUY","VERNEUIL"]
[823,null,null,null,null,"","CH PEGUY","VERNEUIL"]
[824,null,null,null,null,"","CH PEGUY","VERNEUIL"]
[825,null,null,null,null,"","CH PEGUY","VERNEUIL"]
[826,null,null,null,null,"","CH PEGUY","VERNEUIL"]
[827,null,null,null,null,"","CH PEGUY","VERNEUIL"]
[828,null,null,null,null,"","CH PEGUY","VERNEUIL"]
[829,null,null,null,null,"","CH PEGUY","VERNEUIL"]
[830,null,null,null,null,"","CH PEGUY","VERNEUIL"]
[831,null,null,null,null,"","CH PEGUY","VERNEUIL"]
[832,null,null,null,null,"","CH PEGUY","VERNEUIL"]
[833,null,null,null,null,{"$f":"IF(D834=\"\",\"\",IF(E834=\"f\",LOOKUP(D834,cat_unss,cat_f),LOOKUP(D834,cat_unss,cat_g)))","v":""},"CH PEGUY","VERNEUIL"]
[834,null,null,null,null,"","CH PEGUY","VERNEUIL"]
[835,null,null,null,null,"","CH PEGUY","VERNEUIL"]
[836,null,null,null,null,"","CH PEGUY","VERNEUIL"]
[837,null,null,null,null,"","CH PEGUY","VERNEUIL"]
[838,null,null,null,null,"","CH PEGUY","VERNEUIL"]
[839,null,null,null,null,"","CH PEGUY","VERNEUIL"]
[840,null,null,null,null,"","CH PEGUY","VERNEUIL"]
[841,null,null,null,null,"","CH PEGUY","VERNEUIL"]
[842,null,null,null,null,"","CH PEGUY","VERNEUIL"]
[843,null,null,null,null,"","CH PEGUY","VERNEUIL"]
[844,null,null,null,null,"","CH PEGUY","VERNEUIL"]
[845,null,null,null,null,"","CH PEGUY","VERNEUIL"]
[846,null,null,null,null,"","CH PEGUY","VERNEUIL"]
[847,null,null,null,null,"","CH PEGUY","VERNEUIL"]
[848,null,null,null,null,"","CH PEGUY","VERNEUIL"]
[849,null,null,null,null,"","CH PEGUY","VERNEUIL"]
[850,null,null,null,null,"","CH PEGUY","VERNEUIL"]
[851,null,null,null,null,"","CH PEGUY","VERNEUIL"]
[852,null,null,null,null,"","CH PEGUY","VERNEUIL"]
[853,null,null,null,null,"","CH PEGUY","VERNEUIL"]
[854,null,null,null,null,"","CH PEGUY","VERNEUIL"]
[855,null,null,null,null,"","CH PEGUY","VERNEUIL"]
[856,null,null,null,null,"","CH PEGUY","VERNEUIL"]
[857,null,null,null,null,"","CH PEGUY","VERNEUIL"]
[858,null,null,null,null,"","CH PEGUY","VERNEUIL"]
[859,null,null,null,null,"","CH PEGUY","VERNEUIL"]
[860,null,null,null,null,"","CH PEGUY","VERNEUIL"]
[861,null,null,null,null,"","CH PEGUY","VERNEUIL"]
[862,null,null,null,null,"","CH PEGUY","VERNEUIL"]
[863,null,null,null,null,"","CH PEGUY","VERNEUIL"]
[864,null,null,null,null,"","CH PEGUY","VERNEUIL"]
[865,null,null,null,null,"","CH PEGUY","VERNEUIL"]
[866,null,null,null,null,"","CH PEGUY","VERNEUIL"]
[867,null,null,null,null,"","CH PEGUY","VERNEUIL"]
[868,null,null,null,null,"","CH PEGUY","VERNEUIL"]
[869,null,null,null,null,"","CH PEGUY","VERNEUIL"]
[870,null,null,null,null,"","CH PEGUY","VERNEUIL"]
[871,null,null,null,null,"","CH PEGUY","VERNEUIL"]
[872,null,null,null,null,"","CH PEGUY","VERNEUIL"]
[873,null,null,null,null,"","CH PEGUY","VERNEUIL"]
[874,null,null,null,null,"","CH PEGUY","VERNEUIL"]
[875,null,null,null,null,"","CH PEGUY","VERNEUIL"]
[876,null,null,null,null,"","CH PEGUY","VERNEUIL"]
[877,null,null,null,null,"","CH PEGUY","VERNEUIL"]
[878,null,null,null,null,"","CH PEGUY","VERNEUIL"]
[879,null,null,null,null,"","CH PEGUY","VERNEUIL"]
[880,null,null,null,null,"","CH PEGUY","VERNEUIL"]
[881,null,null,null,null,"","CH PEGUY","VERNEUIL"]
[882,null,null,null,null,"","CH PEGUY","VERNEUIL"]
[883,null,null,null,null,"","CH PEGUY","VERNEUIL"]
[884,null,null,null,null,"","CH PEGUY","VERNEUIL"]
[885,null,null,null,null,"","CH PEGUY","VERNEUIL"]
[886,null,null,null,null,"","CH PEGUY","VERNEUIL"]
[887,null,null,null,null,"","CH PEGUY","VERNEUIL"]
[888,null,null,null,null,"","CH PEGUY","VERNEUIL"]
[889,null,null,null,null,"","CH PEGUY","VERNEUIL"]
[890,null,null,null,null,"","CH PEGUY","VERNEUIL"]
[891,null,null,null,null,"","CH PEGUY","VERNEUIL"]
[892,null,null,null,null,"","CH PEGUY","VERNEUIL"]
[893,null,null,null,null,"","CH PEGUY","VERNEUIL"]
[894,null,null,null,null,"","CH PEGUY","VERNEUIL"]
[895,null,null,null,null,"","CH PEGUY","VERNEUIL"]
[896,null,null,null,null,"","CH PEGUY","VERNEUIL"]
[897,null,null,null,null,{"$f":"IF(D898=\"\",\"\",IF(E898=\"f\",LOOKUP(D898,cat_unss,cat_f),LOOKUP(D898,cat_unss,cat_g)))","v":""},"CH PEGUY","VERNEUIL"]
[898,null,null,null,null,"","CH PEGUY","VERNEUIL"]
[899,null,null,null,null,"","CH PEGUY","VERNEUIL"]
[900,null,null,null,null,"","CH PEGUY","VERNEUIL"]
[901,"GUESSARD","Adrien",2001,"G","CG","CHOPIN","MELUN"]
[902,"MANGLOU","Mathias",2002,"G","MG","CHOPIN","MELUN"]
[903,"TEKA MAYALU","Kévin",2002,"G","MG","CHOPIN","MELUN"]
[904,"MOPIA","Mickaël",2003,"G","MG","CHOPIN","MELUN"]
[905,"DIAKITE","Sambou",2001,"G","CG","CHOPIN","MELUN"]
[906,"GUESSARD","Julien",2001,"G","CG","CHOPIN","MELUN"]
[907,"OULD DAHMANE","Ishaq",2002,"G","MG","CHOPIN","MELUN"]
[908,"GAUCHER","Christopher",2001,"G","CG","CHOPIN","MELUN"]
[909,"FLORSCH","Luc",2003,"G","MG","CHOPIN","MELUN"]
[910,"VIOL","William",2003,"G","MG","CHOPIN","MELUN"]
[911,"COULIBALY","Djhélika",2003,"F","MF","CHOPIN","MELUN"]
[912,"METERFI","Sarah",2002,"F","MF","CHOPIN","MELUN"]
[913,"DELUGE","Mélissa",2002,"F","MF","CHOPIN","MELUN"]
[914,"LACHGAR","Sofia",2002,"F","MF","CHOPIN","MELUN"]
[915,"JABRI","Ouided",2003,"F","MF","CHOPIN","MELUN"]
[916,"PONCHE","Anaïs",2002,"F","MF","CHOPIN","MELUN"]
[917,"BENZIANE","Halima",2003,"F","MF","CHOPIN","MELUN"]
[918,"ANKOURI","Wassila",2005,"F","BF1","CHOPIN","MELUN"]
[919,"KERDUDO","Inès",2003,"F","MF","CHOPIN","MELUN"]
[920,"SAMINOU KOUBEMBA","Cassandra",2001,"F","CF","CHOPIN","MELUN"]
[921,"MEBTOUL","Samir",2004,"G","BG2","CHOPIN","MELUN"]
[922,"Tchivanga","Kyle",2004,"G","BG2","CHOPIN","MELUN"]
[923,"TEKA MAYALU","Ryan",2004,"G","BG2","CHOPIN","MELUN"]
[924,"BENALI","Riad-Mohamed",2004,"G","BG2","CHOPIN","MELUN"]
[925,"FRIGUI","Ahmed",2005,"G","BG1","CHOPIN","MELUN"]
[926,"CAKAN","Adar",2004,"G","BG2","CHOPIN","MELUN"]
[927,"Loulendo","Merhyl",2004,"G","BG2","CHOPIN","MELUN"]
[928,"FIRAT","Rojhat",2004,"G","BG2","CHOPIN","MELUN"]
[929,"JOUAN","Haytam",2005,"G","BG1","CHOPIN","MELUN"]
[930,"BESSIN","Jarod",2004,"G","BG2","CHOPIN","MELUN"]
[931,"LUVANGADIO-DITOMA","Estelle",2004,"F","BF2","CHOPIN","MELUN"]
[932,"MANGLOU","Camille",2005,"F","BF1","CHOPIN","MELUN"]
[933,"BRITO","Leana",2004,"F","BF2","CHOPIN","MELUN"]
[934,"DUMAS","Julie",2003,"F","MF","CHOPIN","MELUN"]
[935,"SISSOKO","Soussaba",2004,"F","BF2","CHOPIN","MELUN"]
[936,"COSTA","Cristivie",2005,"F","BF1","CHOPIN","MELUN"]
[937,"KHELOUFI","Amel",2005,"F","BF1","CHOPIN","MELUN"]
[938,"HAJ-RHOUMA","Dalel",2005,"F","BF1","CHOPIN","MELUN"]
[939,"DANGA NGUINGI","Juliana",2004,"F","BF2","CHOPIN","MELUN"]
[940,"DRICI","Samia",2004,"F","BF2","CHOPIN","MELUN"]
[941,"ABOUFARIS GRALL ","Sofiane","\n\n2004","G",{"$error":"#N/A"},"CHOPIN","MELUN"]
[942,"ADEBAYO Modupé\n\n","Modupé",2005,"F","BF1","CHOPIN","MELUN"]
[943,"AITSALIH \n\n","Younes",2005,"G","BG1","CHOPIN","MELUN"]
[944,"BARKAT\n\n","Mohamed",2003,"G","MG","CHOPIN","MELUN"]
[945,"BARKAT\n","Rima",2005,"F","BF1","CHOPIN","MELUN"]
[946,"BATTIKH \n","Nour el Houda",2004,"F","BF2","CHOPIN","MELUN"]
[947,"BEDEAUX-FARIN ","Clara",2005,"F","BF1","CHOPIN","MELUN"]
[948,"BENCHABANE","Ilyess",2005,"G","BG1","CHOPIN","MELUN"]
[949,"BENDJEBBOUR","Zakaria",2004,"G","BG2","CHOPIN","MELUN"]
[950,"BENDJEBOUR ","Mehdi",2005,"G","BG1","CHOPIN","MELUN"]
[951,"BOUZIANE ","Nassima",2003,"F","MF","CHOPIN","MELUN"]
[952,"COLNOT ","Charly",2005,"G","BG1","CHOPIN","MELUN"]
[953,"CORNET ","Melissa",2003,"F","MF","CHOPIN","MELUN"]
[954,"DANO ","Christopher",2003,"G","MG","CHOPIN","MELUN"]
[955,"DRIOUCH ","Anas",2004,"G","BG2","CHOPIN","MELUN"]
[956,"DURRWEL ","Rudy",2004,"G","BG2","CHOPIN","MELUN"]
[957,"EL ATMIOUI ","Imen",2001,"F","CF","CHOPIN","MELUN"]
[958,"EL BOUAZZOUI ","Adam",2003,"G","MG","CHOPIN","MELUN"]
[959,"ELAAZIZE ","Zakaria",2005,"G","BG1","CHOPIN","MELUN"]
[960,"ERGUN ","Deniz",2004,"G","BG2","CHOPIN","MELUN"]
[961,"GALLEBY ","Cloé",2004,"F",{"$f":"IF(D962=\"\",\"\",IF(E962=\"f\",LOOKUP(D962,cat_unss,cat_f),LOOKUP(D962,cat_unss,cat_g)))","v":"BF2"},"CHOPIN","MELUN"]
[962,"HADBI ","Nassima",2005,"F","BF1","CHOPIN","MELUN"]
[963,"HADBI ","Soulaf",2002,"F","MF","CHOPIN","MELUN"]
[964,"HOCINE ","Yassine",2005,"G","BG1","CHOPIN","MELUN"]
[965,"JUNIET ","Morgane",2004,"F","BF2","CHOPIN","MELUN"]
[966,"KACIMI ","Faresse",2005,"G","BG1","CHOPIN","MELUN"]
[967,"KRISHAN-KUMAR","Riya",2003,"F","MF","CHOPIN","MELUN"]
[968,"KANDULA ","Pierre",2002,"G","MG","CHOPIN","MELUN"]
[969,"KERDUDO ","Bryan",2005,"G","BG1","CHOPIN","MELUN"]
[970,"KHAPIZOV ","Djabrail",2004,"G","BG2","CHOPIN","MELUN"]
[971,"KINKUNDA ","Charlene",2005,"F","BF1","CHOPIN","MELUN"]
[972,"LAIDOUNI ","Rabah-Amine",2005,"G","BG1","CHOPIN","MELUN"]
[973,"LELOIR ","Anthonin",2002,"G","MG","CHOPIN","MELUN"]
[974,"LUCEA ","Menjy",2004,"G","BG2","CHOPIN","MELUN"]
[975,"LUDOVIC ","Sarah",2003,"F","MF","CHOPIN","MELUN"]
[976,"LUFUNDU ","Océane",2003,"F","MF","CHOPIN","MELUN"]
[977,"LUMBNSUNGU ","Eden",2004,"G","BG2","CHOPIN","MELUN"]
[978,"MADEC-CLEÏ ","Allan",2005,"G","BG1","CHOPIN","MELUN"]
[979,"MAJDOUB ","Mariem",2005,"F","BF1","CHOPIN","MELUN"]
[980,"MAKIDI CONSTANTINIDIS ","Valentin",2004,"G","BG2","CHOPIN","MELUN"]
[981,"MANZILA ","Bradel",2006,"G","BG1","CHOPIN","MELUN"]
[982,"MIDEY ","Théo",2005,"G","BG1","CHOPIN","MELUN"]
[983,"MILOT ","Dylan",2003,"G","MG","CHOPIN","MELUN"]
[984,"MNIA ","Firdaws",2005,"M","BG1","CHOPIN","MELUN"]
[985,"MOHAMMAD ","Omar",2005,"G","BG1","CHOPIN","MELUN"]
[986,"MOKEDDEM ","Fowed",2004,"G","BG2","CHOPIN","MELUN"]
[987,"MOKFI","Rayan",2004,"G","BG2","CHOPIN","MELUN"]
[988,"MOUNA ","Jessy",2005,"F","BF1","CHOPIN","MELUN"]
[989,"N'DIAYE ","Mariam",2002,"F","MF","CHOPIN","MELUN"]
[990,"NDIAYE ","Cheikh",2003,"G","MG","CHOPIN","MELUN"]
[991,"NDIAYE","Cyrille",2001,"G","CG","CHOPIN","MELUN"]
[992,"OUKASSOU ","Mohamed",2004,"G","BG2","CHOPIN","MELUN"]
[993,"POUILLOUX ","Lucile",2005,"F","BF1","CHOPIN","MELUN"]
[994,"RAMDANI ","Yahia",2003,"G","MG","CHOPIN","MELUN"]
[995,"RUSMANN ","Clément",2004,"G","BG2","CHOPIN","MELUN"]
[996,"SAMBAKE ","Bandiougou",2005,"G","BG1","CHOPIN","MELUN"]
[997,"SITYRYNSKYY ","Andriy",2004,"G","BG2","CHOPIN","MELUN"]
[998,"SURUT ","Hugo",2005,"G","BG1","CHOPIN","MELUN"]
[999,"VERRES ","Clément",2004,"G","BG2","CHOPIN","MELUN"]
[1000,"YANOGO ","Lindsay",2005,"F","BF1","CHOPIN","MELUN"]
[1001,"YESILBAS","Rumeysa",2005,"F","BF1","CHOPIN","MELUN"]
[1002,"YESILBAS ","Yousoufcan",2004,"G","BG2","CHOPIN","MELUN"]
[1003,"YOKAN KAMDEM","Linda",2004,"F","BF2","CHOPIN","MELUN"]
[1004,"ZANNIER ","Melvin",2003,"G","MG","CHOPIN","MELUN"]
[1005,"ZENDAOUA ","Mohamed-Amine",2005,"G","BG1","CHOPIN","MELUN"]
[1006,null,null,null,null,"","CHOPIN","MELUN"]
[1007,null,null,null,null,"","CHOPIN","MELUN"]
[1008,null,null,null,null,"","CHOPIN","MELUN"]
[1009,null,null,null,null,"","CHOPIN","MELUN"]
[1010,null,null,null,null,"","CHOPIN","MELUN"]
[1011,null,null,null,null,"","CHOPIN","MELUN"]
[1012,null,null,null,null,"","CHOPIN","MELUN"]
[1013,null,null,null,null,"","CHOPIN","MELUN"]
[1014,null,null,null,null,"","CHOPIN","MELUN"]
[1015,null,null,null,null,"","CHOPIN","MELUN"]
[1016,null,null,null,null,"","CHOPIN","MELUN"]
[1017,null,null,null,null,"","CHOPIN","MELUN"]
[1018,null,null,null,null,"","CHOPIN","MELUN"]
[1019,null,null,null,null,"","CHOPIN","MELUN"]
[1020,null,null,null,null,"","CHOPIN","MELUN"]
[1021,null,null,null,null,"","CHOPIN","MELUN"]
[1022,null,null,null,null,"","CHOPIN","MELUN"]
[1023,null,null,null,null,"","CHOPIN","MELUN"]
[1024,null,null,null,null,"","CHOPIN","MELUN"]
[1025,null,null,null,null,{"$f":"IF(D1026=\"\",\"\",IF(E1026=\"f\",LOOKUP(D1026,cat_unss,cat_f),LOOKUP(D1026,cat_unss,cat_g)))","v":""},"CHOPIN","MELUN"]
[1026,null,null,null,null,"","CHOPIN","MELUN"]
[1027,null,null,null,null,"","CHOPIN","MELUN"]
[1028,null,null,null,null,"","CHOPIN","MELUN"]
[1029,null,null,null,null,"","CHOPIN","MELUN"]
[1030,null,null,null,null,"","CHOPIN","MELUN"]
[1031,null,null,null,null,"","CHOPIN","MELUN"]
[1032,null,null,null,null,"","CHOPIN","MELUN"]
[1033,null,null,null,null,"","CHOPIN","MELUN"]
[1034,null,null,null,null,"","CHOPIN","MELUN"]
[1035,null,null,null,null,"","CHOPIN","MELUN"]
[1036,null,null,null,null,"","CHOPIN","MELUN"]
[1037,null,null,null,null,"","CHOPIN","MELUN"]
[1038,null,null,null,null,"","CHOPIN","MELUN"]
[1039,null,null,null,null,"","CHOPIN","MELUN"]
[1040,null,null,null,null,"","CHOPIN","MELUN"]
[1041,null,null,null,null,"","CHOPIN","MELUN"]
[1042,null,null,null,null,"","CHOPIN","MELUN"]
[1043,null,null,null,null,"","CHOPIN","MELUN"]
[1044,null,null,null,null,"","CHOPIN","MELUN"]
[1045,null,null,null,null,"","CHOPIN","MELUN"]
[1046,null,null,null,null,"","CHOPIN","MELUN"]
[1047,null,null,null,null,"","CHOPIN","MELUN"]
[1048,null,null,null,null,"","CHOPIN","MELUN"]
[1049,null,null,null,null,"","CHOPIN","MELUN"]
[1050,null,null,null,null,"","CHOPIN","MELUN"]
[1051,null,null,null,null,"","CHOPIN","MELUN"]
[1052,null,null,null,null,"","CHOPIN","MELUN"]
[1053,null,null,null,null,"","CHOPIN","MELUN"]
[1054,null,null,null,null,"","CHOPIN","MELUN"]
[1055,null,null,null,null,"","CHOPIN","MELUN"]
[1056,null,null,null,null,"","CHOPIN","MELUN"]
[1057,null,null,null,null,"","CHOPIN","MELUN"]
[1058,null,null,null,null,"","CHOPIN","MELUN"]
[1059,null,null,null,null,"","CHOPIN","MELUN"]
[1060,null,null,null,null,"","CHOPIN","MELUN"]
[1061,null,null,null,null,"","CHOPIN","MELUN"]
[1062,null,null,null,null,"","CHOPIN","MELUN"]
[1063,null,null,null,null,"","CHOPIN","MELUN"]
[1064,null,null,null,null,"","CHOPIN","MELUN"]
[1065,null,null,null,null,"","CHOPIN","MELUN"]
[1066,null,null,null,null,"","CHOPIN","MELUN"]
[1067,null,null,null,null,"","CHOPIN","MELUN"]
[1068,null,null,null,null,"","CHOPIN","MELUN"]
[1069,null,null,null,null,"","CHOPIN","MELUN"]
[1070,null,null,null,null,"","CHOPIN","MELUN"]
[1071,null,null,null,null,"","CHOPIN","MELUN"]
[1072,null,null,null,null,"","CHOPIN","MELUN"]
[1073,null,null,null,null,"","CHOPIN","MELUN"]
[1074,null,null,null,null,"","CHOPIN","MELUN"]
[1075,null,null,null,null,"","CHOPIN","MELUN"]
[1076,null,null,null,null,"","CHOPIN","MELUN"]
[1077,null,null,null,null,"","CHOPIN","MELUN"]
[1078,null,null,null,null,"","CHOPIN","MELUN"]
[1079,null,null,null,null,"","CHOPIN","MELUN"]
[1080,null,null,null,null,"","CHOPIN","MELUN"]
[1081,null,null,null,null,"","CHOPIN","MELUN"]
[1082,null,null,null,null,"","CHOPIN","MELUN"]
[1083,null,null,null,null,"","CHOPIN","MELUN"]
[1084,null,null,null,null,"","CHOPIN","MELUN"]
[1085,null,null,null,null,"","CHOPIN","MELUN"]
[1086,null,null,null,null,"","CHOPIN","MELUN"]
[1087,null,null,null,null,"","CHOPIN","MELUN"]
[1088,null,null,null,null,"","CHOPIN","MELUN"]
[1089,null,null,null,null,{"$f":"IF(D1090=\"\",\"\",IF(E1090=\"f\",LOOKUP(D1090,cat_unss,cat_f),LOOKUP(D1090,cat_unss,cat_g)))","v":""},"CHOPIN","MELUN"]
[1090,null,null,null,null,"","CHOPIN","MELUN"]
[1091,null,null,null,null,"","CHOPIN","MELUN"]
[1092,null,null,null,null,"","CHOPIN","MELUN"]
[1093,null,null,null,null,"","CHOPIN","MELUN"]
[1094,null,null,null,null,"","CHOPIN","MELUN"]
[1095,null,null,null,null,"","CHOPIN","MELUN"]
[1096,null,null,null,null,"","CHOPIN","MELUN"]
[1097,null,null,null,null,"","CHOPIN","MELUN"]
[1098,null,null,null,null,"","CHOPIN","MELUN"]
[1099,null,null,null,null,"","CHOPIN","MELUN"]
[1100,null,null,null,null,"","CHOPIN","MELUN"]
[1101,null,null,null,null,"","CHOPIN","MELUN"]
[1102,null,null,null,null,"","CHOPIN","MELUN"]
[1103,null,null,null,null,"","CHOPIN","MELUN"]
[1104,null,null,null,null,"","CHOPIN","MELUN"]
[1105,null,null,null,null,"","CHOPIN","MELUN"]
[1106,null,null,null,null,"","CHOPIN","MELUN"]
[1107,null,null,null,null,"","CHOPIN","MELUN"]
[1108,null,null,null,null,"","CHOPIN","MELUN"]
[1109,null,null,null,null,"","CHOPIN","MELUN"]
[1110,null,null,null,null,"","CHOPIN","MELUN"]
[1111,null,null,null,null,"","CHOPIN","MELUN"]
[1112,null,null,null,null,"","CHOPIN","MELUN"]
[1113,null,null,null,null,"","CHOPIN","MELUN"]
[1114,null,null,null,null,"","CHOPIN","MELUN"]
[1115,null,null,null,null,"","CHOPIN","MELUN"]
[1116,null,null,null,null,"","CHOPIN","MELUN"]
[1117,null,null,null,null,"","CHOPIN","MELUN"]
[1118,null,null,null,null,"","CHOPIN","MELUN"]
[1119,null,null,null,null,"","CHOPIN","MELUN"]
[1120,null,null,null,null,"","CHOPIN","MELUN"]
[1121,null,null,null,null,"","CHOPIN","MELUN"]
[1122,null,null,null,null,"","CHOPIN","MELUN"]
[1123,null,null,null,null,"","CHOPIN","MELUN"]
[1124,null,null,null,null,"","CHOPIN","MELUN"]
[1125,null,null,null,null,"","CHOPIN","MELUN"]
[1126,null,null,null,null,"","CHOPIN","MELUN"]
[1127,null,null,null,null,"","CHOPIN","MELUN"]
[1128,null,null,null,null,"","CHOPIN","MELUN"]
[1129,null,null,null,null,"","CHOPIN","MELUN"]
[1130,null,null,null,null,"","CHOPIN","MELUN"]
[1131,null,null,null,null,"","CHOPIN","MELUN"]
[1132,null,null,null,null,"","CHOPIN","MELUN"]
[1133,null,null,null,null,"","CHOPIN","MELUN"]
[1134,null,null,null,null,"","CHOPIN","MELUN"]
[1135,null,null,null,null,"","CHOPIN","MELUN"]
[1136,null,null,null,null,"","CHOPIN","MELUN"]
[1137,null,null,null,null,"","CHOPIN","MELUN"]
[1138,null,null,null,null,"","CHOPIN","MELUN"]
[1139,null,null,null,null,"","CHOPIN","MELUN"]
[1140,null,null,null,null,"","CHOPIN","MELUN"]
[1141,null,null,null,null,"","CHOPIN","MELUN"]
[1142,null,null,null,null,"","CHOPIN","MELUN"]
[1143,null,null,null,null,"","CHOPIN","MELUN"]
[1144,null,null,null,null,"","CHOPIN","MELUN"]
[1145,null,null,null,null,"","CHOPIN","MELUN"]
[1146,null,null,null,null,"","CHOPIN","MELUN"]
[1147,null,null,null,null,"","CHOPIN","MELUN"]
[1148,null,null,null,null,"","CHOPIN","MELUN"]
[1149,null,null,null,null,"","CHOPIN","MELUN"]
[1150,null,null,null,null,"","CHOPIN","MELUN"]
[1151,null,null,null,null,"","CHOPIN","MELUN"]
[1152,null,null,null,null,"","CHOPIN","MELUN"]
[1153,null,null,null,null,{"$f":"IF(D1154=\"\",\"\",IF(E1154=\"f\",LOOKUP(D1154,cat_unss,cat_f),LOOKUP(D1154,cat_unss,cat_g)))","v":""},"CHOPIN","MELUN"]
[1154,null,null,null,null,"","CHOPIN","MELUN"]
[1155,null,null,null,null,"","CHOPIN","MELUN"]
[1156,null,null,null,null,"","CHOPIN","MELUN"]
[1157,null,null,null,null,"","CHOPIN","MELUN"]
[1158,null,null,null,null,"","CHOPIN","MELUN"]
[1159,null,null,null,null,"","CHOPIN","MELUN"]
[1160,null,null,null,null,"","CHOPIN","MELUN"]
[1161,null,null,null,null,"","CHOPIN","MELUN"]
[1162,null,null,null,null,"","CHOPIN","MELUN"]
[1163,null,null,null,null,"","CHOPIN","MELUN"]
[1164,null,null,null,null,"","CHOPIN","MELUN"]
[1165,null,null,null,null,"","CHOPIN","MELUN"]
[1166,null,null,null,null,"","CHOPIN","MELUN"]
[1167,null,null,null,null,"","CHOPIN","MELUN"]
[1168,null,null,null,null,"","CHOPIN","MELUN"]
[1169,null,null,null,null,"","CHOPIN","MELUN"]
[1170,null,null,null,null,"","CHOPIN","MELUN"]
[1171,null,null,null,null,"","CHOPIN","MELUN"]
[1172,null,null,null,null,"","CHOPIN","MELUN"]
[1173,null,null,null,null,"","CHOPIN","MELUN"]
[1174,null,null,null,null,"","CHOPIN","MELUN"]
[1175,null,null,null,null,"","CHOPIN","MELUN"]
[1176,null,null,null,null,"","CHOPIN","MELUN"]
[1177,null,null,null,null,"","CHOPIN","MELUN"]
[1178,null,null,null,null,"","CHOPIN","MELUN"]
[1179,null,null,null,null,"","CHOPIN","MELUN"]
[1180,null,null,null,null,"","CHOPIN","MELUN"]
[1181,null,null,null,null,"","CHOPIN","MELUN"]
[1182,null,null,null,null,"","CHOPIN","MELUN"]
[1183,null,null,null,null,"","CHOPIN","MELUN"]
[1184,null,null,null,null,"","CHOPIN","MELUN"]
[1185,null,null,null,null,"","CHOPIN","MELUN"]
[1186,null,null,null,null,"","CHOPIN","MELUN"]
[1187,null,null,null,null,"","CHOPIN","MELUN"]
[1188,null,null,null,null,"","CHOPIN","MELUN"]
[1189,null,null,null,null,"","CHOPIN","MELUN"]
[1190,null,null,null,null,"","CHOPIN","MELUN"]
[1191,null,null,null,null,"","CHOPIN","MELUN"]
[1192,null,null,null,null,"","CHOPIN","MELUN"]
[1193,null,null,null,null,"","CHOPIN","MELUN"]
[1194,null,null,null,null,"","CHOPIN","MELUN"]
[1195,null,null,null,null,"","CHOPIN","MELUN"]
[1196,null,null,null,null,"","CHOPIN","MELUN"]
[1197,null,null,null,null,"","CHOPIN","MELUN"]
[1198,null,null,null,null,"","CHOPIN","MELUN"]
[1199,null,null,null,null,"","CHOPIN","MELUN"]
[1200,null,null,null,null,"","CHOPIN","MELUN"]
[1201,"BACH","Elisa",2005,"F","BF1","DE PISAN","PERTHES"]
[1202,"DUROUSSEAU","Justine",2005,"F","BF1","DE PISAN","PERTHES"]
[1203,"BENARD","Audrey",2005,"F","BF1","DE PISAN","PERTHES"]
[1204,"LARCHE","Aliénor",2005,"F","BF1","DE PISAN","PERTHES"]
[1205,"NEGRIE","Camille",2005,"F","BF1","DE PISAN","PERTHES"]
[1206,"MAXIMINO MARQUES","Alexia",2005,"F","BF1","DE PISAN","PERTHES"]
[1207,"DELIGNE","Jeanne",2005,"F","BF1","DE PISAN","PERTHES"]
[1208,"DECOLOGNE","Arwen",2005,"F","BF1","DE PISAN","PERTHES"]
[1209,"SERVEAUX","Lisa",2005,"F","BF1","DE PISAN","PERTHES"]
[1210,"MBRENGA","Gabriella",2005,"F","BF1","DE PISAN","PERTHES"]
[1211,"PEIXOTO","Elodie",2005,"F","BF1","DE PISAN","PERTHES"]
[1212,"LOQUET","Victoire",2005,"F","BF1","DE PISAN","PERTHES"]
[1213,"NICOLAÏ","Lola",2005,"F","BF1","DE PISAN","PERTHES"]
[1214,"COMBELASSE","Maéline",2005,"F","BF1","DE PISAN","PERTHES"]
[1215,"IDIR","Shirine",2005,"F","BF1","DE PISAN","PERTHES"]
[1216,"BLIN","Cassandre",2005,"F","BF1","DE PISAN","PERTHES"]
[1217,"CHAILLOU","Maude",2005,"F",{"$f":"IF(D1218=\"\",\"\",IF(E1218=\"f\",LOOKUP(D1218,cat_unss,cat_f),LOOKUP(D1218,cat_unss,cat_g)))","v":"BF1"},"DE PISAN","PERTHES"]
[1218,"HELLBORG--POUYAUD","Greta",2005,"F","BF1","DE PISAN","PERTHES"]
[1219,"REBELO","Lana",2005,"F","BF1","DE PISAN","PERTHES"]
[1220,"FOUCAULT-REMY","Leane",2005,"F","BF1","DE PISAN","PERTHES"]
[1221,"LAMARE","Nicolas",2005,"G","BG1","DE PISAN","PERTHES"]
[1222,"MARTINET","Clément",2005,"G","BG1","DE PISAN","PERTHES"]
[1223,"DI PASQUALE","Adrian",2005,"G","BG1","DE PISAN","PERTHES"]
[1224,"PESTAT","Tilouan",2005,"G","BG1","DE PISAN","PERTHES"]
[1225,"CRISTOVAO","Baptiste",2005,"G","BG1","DE PISAN","PERTHES"]
[1226,"DA SILVA","Diego",2005,"G","BG1","DE PISAN","PERTHES"]
[1227,"HUBERT","Lucas",2005,"G","BG1","DE PISAN","PERTHES"]
[1228,"MILLOT","Lancelot",2005,"G","BG1","DE PISAN","PERTHES"]
[1229,"DAMASSE","Nathan",2005,"G","BG1","DE PISAN","PERTHES"]
[1230,"BOLMIER","Mattéo",2005,"G","BG1","DE PISAN","PERTHES"]
[1231,"HAVARD","Nathan",2005,"G","BG1","DE PISAN","PERTHES"]
[1232,"JOLY","Maxime",2005,"G","BG1","DE PISAN","PERTHES"]
[1233,"MOITIE","Lysandre",2005,"G","BG1","DE PISAN","PERTHES"]
[1234,"BOURNEL","Gabriel",2005,"G","BG1","DE PISAN","PERTHES"]
[1235,"BOURGEOIS","Mathis",2005,"G","BG1","DE PISAN","PERTHES"]
[1236,"GILLET","Malvin",2005,"G","BG1","DE PISAN","PERTHES"]
[1237,"BAILAY","Eliott",2005,"G","BG1","DE PISAN","PERTHES"]
[1238,"GODARD","Dalian",2005,"G","BG1","DE PISAN","PERTHES"]
[1239,"DECABOOTER-HOLLEMAN","Timothee",2005,"G","BG1","DE PISAN","PERTHES"]
[1240,"MAISSE","Shun",2005,"G","BG1","DE PISAN","PERTHES"]
[1241,"BONNET","Alexandra",2004,"F","BF2","DE PISAN","PERTHES"]
[1242,"DUMONT","Paloma",2004,"F","BF2","DE PISAN","PERTHES"]
[1243,"LEMAIRE","Célia",2004,"F","BF2","DE PISAN","PERTHES"]
[1244,"LEMEE","Aurore",2004,"F","BF2","DE PISAN","PERTHES"]
[1245,"GONZALEZ","Clara",2004,"F","BF2","DE PISAN","PERTHES"]
[1246,"RIAUD","Trinity",2004,"F","BF2","DE PISAN","PERTHES"]
[1247,"BAUJARD","Léa",2004,"F","BF2","DE PISAN","PERTHES"]
[1248,"MAUGAIN","Léonie",2004,"F","BF2","DE PISAN","PERTHES"]
[1249,"MBALLA BATCHY","Jade",2004,"F","BF2","DE PISAN","PERTHES"]
[1250,"ANTUNES","Ana",2004,"F","BF2","DE PISAN","PERTHES"]
[1251,"ARISTOT","Anais",2004,"F","BF2","DE PISAN","PERTHES"]
[1252,"AIGRET","Lisa",2004,"F","BF2","DE PISAN","PERTHES"]
[1253,"WREMBEL","Juliette",2004,"F","BF2","DE PISAN","PERTHES"]
[1254,"DUROT","Marina",2004,"F","BF2","DE PISAN","PERTHES"]
[1255,"LECLERCQ","Mariane",2004,"F","BF2","DE PISAN","PERTHES"]
[1256,"GUERIN","Noémie",2004,"F","BF2","DE PISAN","PERTHES"]
[1257,"MORVAN","Doriane",2004,"F","BF2","DE PISAN","PERTHES"]
[1258,"SEIXAS","Soraia",2004,"F","BF2","DE PISAN","PERTHES"]
[1259,"MAHOMED KHAN","Anissa",2004,"F","BF2","DE PISAN","PERTHES"]
[1260,"BACH","Justine",2004,"F","BF2","DE PISAN","PERTHES"]
[1261,"IKUNGU BOMOLO","Imâan",2004,"G","BG2","DE PISAN","PERTHES"]
[1262,"GONTHIER","Kylian",2004,"G","BG2","DE PISAN","PERTHES"]
[1263,"INCANDELA","Baptiste",2004,"G","BG2","DE PISAN","PERTHES"]
[1264,"KIM","Sylvain",2004,"G","BG2","DE PISAN","PERTHES"]
[1265,"DESFOSSES","Florian",2004,"G","BG2","DE PISAN","PERTHES"]
[1266,"COLONNA","Adrien Dorius",2004,"G","BG2","DE PISAN","PERTHES"]
[1267,"SYLVAIN","Julien",2004,"G","BG2","DE PISAN","PERTHES"]
[1268,"MIALET","Antoine",2004,"G","BG2","DE PISAN","PERTHES"]
[1269,"CABEZAS EGEA","Amaury",2004,"G","BG2","DE PISAN","PERTHES"]
[1270,"MARSAUD","Mathis",2004,"G","BG2","DE PISAN","PERTHES"]
[1271,"SIGNOL","Quentin",2004,"G","BG2","DE PISAN","PERTHES"]
[1272,"CIZDZIEL","Matthieu",2004,"G","BG2","DE PISAN","PERTHES"]
[1273,"GOMES","Hugo",2004,"G","BG2","DE PISAN","PERTHES"]
[1274,"GRYKO","Morgan",2004,"G","BG2","DE PISAN","PERTHES"]
[1275,"HUBERT","Julien",2004,"G","BG2","DE PISAN","PERTHES"]
[1276,"LAKHLIFI","Yanis",2004,"G","BG2","DE PISAN","PERTHES"]
[1277,"BILLARD","Fabien",2004,"G","BG2","DE PISAN","PERTHES"]
[1278,"PERIOT","Simon",2004,"G","BG2","DE PISAN","PERTHES"]
[1279,"DUTECH","Ewan",2004,"G","BG2","DE PISAN","PERTHES"]
[1280,"EL MZIOUZI","Taha",2004,"G","BG2","DE PISAN","PERTHES"]
[1281,"FLAMANT","Lisa",2003,"F",{"$f":"IF(D1282=\"\",\"\",IF(E1282=\"f\",LOOKUP(D1282,cat_unss,cat_f),LOOKUP(D1282,cat_unss,cat_g)))","v":"MF"},"DE PISAN","PERTHES"]
[1282,"TEXIER","Athénaïs",2003,"F","MF","DE PISAN","PERTHES"]
[1283,"CAILLERET","Iris",2003,"F","MF","DE PISAN","PERTHES"]
[1284,"DE AMORIM","Jade",2003,"F","MF","DE PISAN","PERTHES"]
[1285,"LIMA REGO","Maëva",2003,"F","MF","DE PISAN","PERTHES"]
[1286,"PESTAT","Erelle",2003,"F","MF","DE PISAN","PERTHES"]
[1287,"ARLIN","Marie",2003,"F","MF","DE PISAN","PERTHES"]
[1288,"FICHEUX","Juliette",2003,"F","MF","DE PISAN","PERTHES"]
[1289,"PERRON","Lilou",2003,"F","MF","DE PISAN","PERTHES"]
[1290,"COLIN","Noa",2003,"F","MF","DE PISAN","PERTHES"]
[1291,"SOULEIMANOV","Khava",2003,"F","MF","DE PISAN","PERTHES"]
[1292,"IDIR","Farha",2003,"F","MF","DE PISAN","PERTHES"]
[1293,"MACHADO","Manon",2003,"F","MF","DE PISAN","PERTHES"]
[1294,"VIGLIANI","Julia",2003,"F","MF","DE PISAN","PERTHES"]
[1295,"PERRAULT","Julie",2003,"F","MF","DE PISAN","PERTHES"]
[1296,"CAPO CHICHI","Séréna",2003,"F","MF","DE PISAN","PERTHES"]
[1297,"JOLLY","Nahia",2003,"F","MF","DE PISAN","PERTHES"]
[1298,"GLAVIER","Julie",2003,"F","MF","DE PISAN","PERTHES"]
[1299,"METZ","Mathilde",2003,"F","MF","DE PISAN","PERTHES"]
[1300,"NOIVILLE","Celya",2003,"F","MF","DE PISAN","PERTHES"]
[1301,"ARAUJO","Thomas",2003,"G","MG","DE PISAN","PERTHES"]
[1302,"MOUREY","Romain",2003,"G","MG","DE PISAN","PERTHES"]
[1303,"CAZIN","Mathieu",2003,"G","MG","DE PISAN","PERTHES"]
[1304,"POULALION","Erwann",2003,"G","MG","DE PISAN","PERTHES"]
[1305,"ESCOMEL","Tom",2003,"G","MG","DE PISAN","PERTHES"]
[1306,"FORICHER","Léo",2003,"G","MG","DE PISAN","PERTHES"]
[1307,"DRIDI","Sami",2003,"G","MG","DE PISAN","PERTHES"]
[1308,"BRUNEAU","André",2003,"G","MG","DE PISAN","PERTHES"]
[1309,"FELICE","Thomas",2003,"G","MG","DE PISAN","PERTHES"]
[1310,"SANSON","Nolan",2003,"G","MG","DE PISAN","PERTHES"]
[1311,"ESSAID","Sofiane",2003,"G","MG","DE PISAN","PERTHES"]
[1312,"MILLOT","Ulysse",2003,"G","MG","DE PISAN","PERTHES"]
[1313,"OURADI","Yasser",2003,"G","MG","DE PISAN","PERTHES"]
[1314,"GOGUELAT","Camille",2003,"G","MG","DE PISAN","PERTHES"]
[1315,"FOURNALES","Logan",2003,"G","MG","DE PISAN","PERTHES"]
[1316,"GIUGIA","Merwan",2003,"G","MG","DE PISAN","PERTHES"]
[1317,"SAFONOV","Gueorgui",2003,"G","MG","DE PISAN","PERTHES"]
[1318,"BACH","Clement",2003,"G","MG","DE PISAN","PERTHES"]
[1319,"CASAGRANDE","Liam",2003,"G","MG","DE PISAN","PERTHES"]
[1320,"NAYROLLES","Arthur",2003,"G","MG","DE PISAN","PERTHES"]
[1321,"RIBEREAU-GAYON","Clotilde",2002,"F","MF","DE PISAN","PERTHES"]
[1322,"BOURGEOIS","Florine",2002,"F","MF","DE PISAN","PERTHES"]
[1323,"BRUNEL","Eva",2002,"F","MF","DE PISAN","PERTHES"]
[1324,"MONTEIRO","Anne Caroline",2002,"F","MF","DE PISAN","PERTHES"]
[1325,"MULLER","Carla",2002,"F","MF","DE PISAN","PERTHES"]
[1326,"ANDRE","Marion",2002,"F","MF","DE PISAN","PERTHES"]
[1327,"CAMILLERI","Thelma",2002,"F","MF","DE PISAN","PERTHES"]
[1328,"RAMET","Alicia",2002,"F","MF","DE PISAN","PERTHES"]
[1329,"DESPRES","Juliette",2002,"F","MF","DE PISAN","PERTHES"]
[1330,"BAUDOUIN","Oceane",2002,"F","MF","DE PISAN","PERTHES"]
[1331,"CHALVET","Romane",2002,"F","MF","DE PISAN","PERTHES"]
[1332,"LABLANCHE","Maëlle",2002,"F","MF","DE PISAN","PERTHES"]
[1333,"GARNAULT","Noémie",2002,"F","MF","DE PISAN","PERTHES"]
[1334,"CENTEIO","Rachel",2002,"F","MF","DE PISAN","PERTHES"]
[1335,"RONZONI","Axelle",2002,"F","MF","DE PISAN","PERTHES"]
[1336,"CAPLAIN","Mathilde",2002,"F","MF","DE PISAN","PERTHES"]
[1337,"BOUSQUET","Diane",2002,"F","MF","DE PISAN","PERTHES"]
[1338,"ARNAUD","Valentine",2002,"F","MF","DE PISAN","PERTHES"]
[1339,"LIGNIERES","Louna",2002,"F","MF","DE PISAN","PERTHES"]
[1340,"BAUDOUIN","Ambre",2002,"F","MF","DE PISAN","PERTHES"]
[1341,"GAUBERVILLE","Arnaud",2002,"G","MG","DE PISAN","PERTHES"]
[1342,"MINNITI ANDREI","Pierre",2002,"G","MG","DE PISAN","PERTHES"]
[1343,"DIDIOT","Alois",2002,"G","MG","DE PISAN","PERTHES"]
[1344,"BOURNEL","Antonin",2002,"G","MG","DE PISAN","PERTHES"]
[1345,"INCANDELA","Thomas",2002,"G",{"$f":"IF(D1346=\"\",\"\",IF(E1346=\"f\",LOOKUP(D1346,cat_unss,cat_f),LOOKUP(D1346,cat_unss,cat_g)))","v":"MG"},"DE PISAN","PERTHES"]
[1346,"LE COZ","Cedric",2002,"G","MG","DE PISAN","PERTHES"]
[1347,"THIERRY","Mathieu",2002,"G","MG","DE PISAN","PERTHES"]
[1348,"MARSAUD","Maël",2002,"G","MG","DE PISAN","PERTHES"]
[1349,"CASTOR","Adrien",2002,"G","MG","DE PISAN","PERTHES"]
[1350,"PINET","Charly",2002,"G","MG","DE PISAN","PERTHES"]
[1351,"GAUTIER","Jules",2002,"G","MG","DE PISAN","PERTHES"]
[1352,"OUDOIRE","Hugo",2002,"G","MG","DE PISAN","PERTHES"]
[1353,"PIZARRO","Mathis",2002,"G","MG","DE PISAN","PERTHES"]
[1354,"LEVY","Noa",2002,"G","MG","DE PISAN","PERTHES"]
[1355,"PORIER","Karl",2002,"G","MG","DE PISAN","PERTHES"]
[1356,"CITÉ","Théo",2002,"G","MG","DE PISAN","PERTHES"]
[1357,"RICARD","Tom",2002,"G","MG","DE PISAN","PERTHES"]
[1358,"CRISTOVAO","Clément",2002,"G","MG","DE PISAN","PERTHES"]
[1359,"ASSELIN","Alexis",2002,"G","MG","DE PISAN","PERTHES"]
[1360,"DURAND","Maxence",2002,"G","MG","DE PISAN","PERTHES"]
[1361,"POTIER","Brice",2003,"G","MG","DE PISAN","PERTHES"]
[1362,"GERMON","Hugo",2002,"G","MG","DE PISAN","PERTHES"]
[1363,"SOUCHARD","Hugo",2004,"G","BG2","DE PISAN","PERTHES"]
[1364,"KERLOGOT","Pierre",2003,"G","MG","DE PISAN","PERTHES"]
[1365,"POTIER","Lyzéa",2004,"F","BF2","DE PISAN","PERTHES"]
[1366,null,null,null,null,"","DE PISAN","PERTHES"]
[1367,null,null,null,null,"","DE PISAN","PERTHES"]
[1368,null,null,null,null,"","DE PISAN","PERTHES"]
[1369,null,null,null,null,"","DE PISAN","PERTHES"]
[1370,null,null,null,null,"","DE PISAN","PERTHES"]
[1371,null,null,null,null,"","DE PISAN","PERTHES"]
[1372,null,null,null,null,"","DE PISAN","PERTHES"]
[1373,null,null,null,null,"","DE PISAN","PERTHES"]
[1374,null,null,null,null,"","DE PISAN","PERTHES"]
[1375,null,null,null,null,"","DE PISAN","PERTHES"]
[1376,null,null,null,null,"","DE PISAN","PERTHES"]
[1377,null,null,null,null,"","DE PISAN","PERTHES"]
[1378,null,null,null,null,"","DE PISAN","PERTHES"]
[1379,null,null,null,null,"","DE PISAN","PERTHES"]
[1380,null,null,null,null,"","DE PISAN","PERTHES"]
[1381,null,null,null,null,"","DE PISAN","PERTHES"]
[1382,null,null,null,null,"","DE PISAN","PERTHES"]
[1383,null,null,null,null,"","DE PISAN","PERTHES"]
[1384,null,null,null,null,"","DE PISAN","PERTHES"]
[1385,null,null,null,null,"","DE PISAN","PERTHES"]
[1386,null,null,null,null,"","DE PISAN","PERTHES"]
[1387,null,null,null,null,"","DE PISAN","PERTHES"]
[1388,null,null,null,null,"","DE PISAN","PERTHES"]
[1389,null,null,null,null,"","DE PISAN","PERTHES"]
[1390,null,null,null,null,"","DE PISAN","PERTHES"]
[1391,null,null,null,null,"","DE PISAN","PERTHES"]
[1392,null,null,null,null,"","DE PISAN","PERTHES"]
[1393,null,null,null,null,"","DE PISAN","PERTHES"]
[1394,null,null,null,null,"","DE PISAN","PERTHES"]
[1395,null,null,null,null,"","DE PISAN","PERTHES"]
[1396,null,null,null,null,"","DE PISAN","PERTHES"]
[1397,null,null,null,null,"","DE PISAN","PERTHES"]
[1398,null,null,null,null,"","DE PISAN","PERTHES"]
[1399,null,null,null,null,"","DE PISAN","PERTHES"]
[1400,null,null,null,null,"","DE PISAN","PERTHES"]
[1401,null,null,null,null,"","DE PISAN","PERTHES"]
[1402,null,null,null,null,"","DE PISAN","PERTHES"]
[1403,null,null,null,null,"","DE PISAN","PERTHES"]
[1404,null,null,null,null,"","DE PISAN","PERTHES"]
[1405,null,null,null,null,"","DE PISAN","PERTHES"]
[1406,null,null,null,null,"","DE PISAN","PERTHES"]
[1407,null,null,null,null,"","DE PISAN","PERTHES"]
[1408,null,null,null,null,"","DE PISAN","PERTHES"]
[1409,null,null,null,null,{"$f":"IF(D1410=\"\",\"\",IF(E1410=\"f\",LOOKUP(D1410,cat_unss,cat_f),LOOKUP(D1410,cat_unss,cat_g)))","v":""},"DE PISAN","PERTHES"]
[1410,null,null,null,null,"","DE PISAN","PERTHES"]
[1411,null,null,null,null,"","DE PISAN","PERTHES"]
[1412,null,null,null,null,"","DE PISAN","PERTHES"]
[1413,null,null,null,null,"","DE PISAN","PERTHES"]
[1414,null,null,null,null,"","DE PISAN","PERTHES"]
[1415,null,null,null,null,"","DE PISAN","PERTHES"]
[1416,null,null,null,null,"","DE PISAN","PERTHES"]
[1417,null,null,null,null,"","DE PISAN","PERTHES"]
[1418,null,null,null,null,"","DE PISAN","PERTHES"]
[1419,null,null,null,null,"","DE PISAN","PERTHES"]
[1420,null,null,null,null,"","DE PISAN","PERTHES"]
[1421,null,null,null,null,"","DE PISAN","PERTHES"]
[1422,null,null,null,null,"","DE PISAN","PERTHES"]
[1423,null,null,null,null,"","DE PISAN","PERTHES"]
[1424,null,null,null,null,"","DE PISAN","PERTHES"]
[1425,null,null,null,null,"","DE PISAN","PERTHES"]
[1426,null,null,null,null,"","DE PISAN","PERTHES"]
[1427,null,null,null,null,"","DE PISAN","PERTHES"]
[1428,null,null,null,null,"","DE PISAN","PERTHES"]
[1429,null,null,null,null,"","DE PISAN","PERTHES"]
[1430,null,null,null,null,"","DE PISAN","PERTHES"]
[1431,null,null,null,null,"","DE PISAN","PERTHES"]
[1432,null,null,null,null,"","DE PISAN","PERTHES"]
[1433,null,null,null,null,"","DE PISAN","PERTHES"]
[1434,null,null,null,null,"","DE PISAN","PERTHES"]
[1435,null,null,null,null,"","DE PISAN","PERTHES"]
[1436,null,null,null,null,"","DE PISAN","PERTHES"]
[1437,null,null,null,null,"","DE PISAN","PERTHES"]
[1438,null,null,null,null,"","DE PISAN","PERTHES"]
[1439,null,null,null,null,"","DE PISAN","PERTHES"]
[1440,null,null,null,null,"","DE PISAN","PERTHES"]
[1441,null,null,null,null,"","DE PISAN","PERTHES"]
[1442,null,null,null,null,"","DE PISAN","PERTHES"]
[1443,null,null,null,null,"","DE PISAN","PERTHES"]
[1444,null,null,null,null,"","DE PISAN","PERTHES"]
[1445,null,null,null,null,"","DE PISAN","PERTHES"]
[1446,null,null,null,null,"","DE PISAN","PERTHES"]
[1447,null,null,null,null,"","DE PISAN","PERTHES"]
[1448,null,null,null,null,"","DE PISAN","PERTHES"]
[1449,null,null,null,null,"","DE PISAN","PERTHES"]
[1450,null,null,null,null,"","DE PISAN","PERTHES"]
[1451,null,null,null,null,"","DE PISAN","PERTHES"]
[1452,null,null,null,null,"","DE PISAN","PERTHES"]
[1453,null,null,null,null,"","DE PISAN","PERTHES"]
[1454,null,null,null,null,"","DE PISAN","PERTHES"]
[1455,null,null,null,null,"","DE PISAN","PERTHES"]
[1456,null,null,null,null,"","DE PISAN","PERTHES"]
[1457,null,null,null,null,"","DE PISAN","PERTHES"]
[1458,null,null,null,null,"","DE PISAN","PERTHES"]
[1459,null,null,null,null,"","DE PISAN","PERTHES"]
[1460,null,null,null,null,"","DE PISAN","PERTHES"]
[1461,null,null,null,null,"","DE PISAN","PERTHES"]
[1462,null,null,null,null,"","DE PISAN","PERTHES"]
[1463,null,null,null,null,"","DE PISAN","PERTHES"]
[1464,null,null,null,null,"","DE PISAN","PERTHES"]
[1465,null,null,null,null,"","DE PISAN","PERTHES"]
[1466,null,null,null,null,"","DE PISAN","PERTHES"]
[1467,null,null,null,null,"","DE PISAN","PERTHES"]
[1468,null,null,null,null,"","DE PISAN","PERTHES"]
[1469,null,null,null,null,"","DE PISAN","PERTHES"]
[1470,null,null,null,null,"","DE PISAN","PERTHES"]
[1471,null,null,null,null,"","DE PISAN","PERTHES"]
[1472,null,null,null,null,"","DE PISAN","PERTHES"]
[1473,null,null,null,null,{"$f":"IF(D1474=\"\",\"\",IF(E1474=\"f\",LOOKUP(D1474,cat_unss,cat_f),LOOKUP(D1474,cat_unss,cat_g)))","v":""},"DE PISAN","PERTHES"]
[1474,null,null,null,null,"","DE PISAN","PERTHES"]
[1475,null,null,null,null,"","DE PISAN","PERTHES"]
[1476,null,null,null,null,"","DE PISAN","PERTHES"]
[1477,null,null,null,null,"","DE PISAN","PERTHES"]
[1478,null,null,null,null,"","DE PISAN","PERTHES"]
[1479,null,null,null,null,"","DE PISAN","PERTHES"]
[1480,null,null,null,null,"","DE PISAN","PERTHES"]
[1481,null,null,null,null,"","DE PISAN","PERTHES"]
[1482,null,null,null,null,"","DE PISAN","PERTHES"]
[1483,null,null,null,null,"","DE PISAN","PERTHES"]
[1484,null,null,null,null,"","DE PISAN","PERTHES"]
[1485,null,null,null,null,"","DE PISAN","PERTHES"]
[1486,null,null,null,null,"","DE PISAN","PERTHES"]
[1487,null,null,null,null,"","DE PISAN","PERTHES"]
[1488,null,null,null,null,"","DE PISAN","PERTHES"]
[1489,null,null,null,null,"","DE PISAN","PERTHES"]
[1490,null,null,null,null,"","DE PISAN","PERTHES"]
[1491,null,null,null,null,"","DE PISAN","PERTHES"]
[1492,null,null,null,null,"","DE PISAN","PERTHES"]
[1493,null,null,null,null,"","DE PISAN","PERTHES"]
[1494,null,null,null,null,"","DE PISAN","PERTHES"]
[1495,null,null,null,null,"","DE PISAN","PERTHES"]
[1496,null,null,null,null,"","DE PISAN","PERTHES"]
[1497,null,null,null,null,"","DE PISAN","PERTHES"]
[1498,null,null,null,null,"","DE PISAN","PERTHES"]
[1499,null,null,null,null,"","DE PISAN","PERTHES"]
[1500,null,null,null,null,"","DE PISAN","PERTHES"]
[1501,"PAWLIK","Clément",2005,"G","BG1","DOISNEAU","DAMMARIE"]
[1502,"ZERBAD","Lyes",2004,"G","BG2","DOISNEAU","DAMMARIE"]
[1503,"GALLET","Bastien",2006,"G","BG1","DOISNEAU","DAMMARIE"]
[1504,"OLUSANYA","Gabriel",2002,"G","MG","DOISNEAU","DAMMARIE"]
[1505,"HAUDRY","Juliette",2003,"F","MF","DOISNEAU","DAMMARIE"]
[1506,"BERRADIA","Feryel",2002,"F","MF","DOISNEAU","DAMMARIE"]
[1507,"BELGACEM","Imène",2002,"F","MF","DOISNEAU","DAMMARIE"]
[1508,"MESSAOUDI","Anas",2003,"G","MG","DOISNEAU","DAMMARIE"]
[1509,"BAKOUZOU","Quentin",2002,"G","MG","DOISNEAU","DAMMARIE"]
[1510,"AIT EL MAALEM","Yliass",2005,"G","BG1","DOISNEAU","DAMMARIE"]
[1511,"LOLKI PAYENGI","Lemaiyan",2005,"M","BG1","DOISNEAU","DAMMARIE"]
[1512,"BAHLAGUI","Shirel",2005,"F","BF1","DOISNEAU","DAMMARIE"]
[1513,"GUILBERT","Thibault",2005,"G","BG1","DOISNEAU","DAMMARIE"]
[1514,"EL GHAZOUANI","Fatima",2005,"F","BF1","DOISNEAU","DAMMARIE"]
[1515,"SADOK-SALAH","Yousra",2005,"F","BF1","DOISNEAU","DAMMARIE"]
[1516,"RICOU","Mattéo",2006,"G","BG1","DOISNEAU","DAMMARIE"]
[1517,"MATHIEU","Maxence",2001,"G","CG","DOISNEAU","DAMMARIE"]
[1518,"KONONGO","Eastland",2003,"G","MG","DOISNEAU","DAMMARIE"]
[1519,"ANTHOUNET","Paul",2003,"G","MG","DOISNEAU","DAMMARIE"]
[1520,"YESILTAS","Derya",2003,"F","MF","DOISNEAU","DAMMARIE"]
[1521,"AISSANI","Yanis",2004,"G","BG2","DOISNEAU","DAMMARIE"]
[1522,"HORTAS","Mylan",2003,"G","MG","DOISNEAU","DAMMARIE"]
[1523,"DINKELDAIN","Aéla",2005,"F","BF1","DOISNEAU","DAMMARIE"]
[1524,"KHATALI","Nesrine",2003,"F","MF","DOISNEAU","DAMMARIE"]
[1525,"ABUBAKAR","Zakiya",2004,"F","BF2","DOISNEAU","DAMMARIE"]
[1526,"BERGER","Lauren",2005,"F","BF1","DOISNEAU","DAMMARIE"]
[1527,"GOURNAY","Valentine",2004,"F","BF2","DOISNEAU","DAMMARIE"]
[1528,"GOUGET","Esteban",2003,"G","MG","DOISNEAU","DAMMARIE"]
[1529,"LERIDER","Allan",2003,"G","MG","DOISNEAU","DAMMARIE"]
[1530,"NOEL","Emmeline",2004,"F","BF2","DOISNEAU","DAMMARIE"]
[1531,"BERAUD","Luna",2004,"F","BF2","DOISNEAU","DAMMARIE"]
[1532,null,null,null,null,"","DOISNEAU","DAMMARIE"]
[1533,null,null,null,null,"","DOISNEAU","DAMMARIE"]
[1534,null,null,null,null,"","DOISNEAU","DAMMARIE"]
[1535,null,null,null,null,"","DOISNEAU","DAMMARIE"]
[1536,null,null,null,null,"","DOISNEAU","DAMMARIE"]
[1537,null,null,null,null,{"$f":"IF(D1538=\"\",\"\",IF(E1538=\"f\",LOOKUP(D1538,cat_unss,cat_f),LOOKUP(D1538,cat_unss,cat_g)))","v":""},"DOISNEAU","DAMMARIE"]
[1538,null,null,null,null,"","DOISNEAU","DAMMARIE"]
[1539,null,null,null,null,"","DOISNEAU","DAMMARIE"]
[1540,null,null,null,null,"","DOISNEAU","DAMMARIE"]
[1541,null,null,null,null,"","DOISNEAU","DAMMARIE"]
[1542,null,null,null,null,"","DOISNEAU","DAMMARIE"]
[1543,null,null,null,null,"","DOISNEAU","DAMMARIE"]
[1544,null,null,null,null,"","DOISNEAU","DAMMARIE"]
[1545,null,null,null,null,"","DOISNEAU","DAMMARIE"]
[1546,null,null,null,null,"","DOISNEAU","DAMMARIE"]
[1547,null,null,null,null,"","DOISNEAU","DAMMARIE"]
[1548,null,null,null,null,"","DOISNEAU","DAMMARIE"]
[1549,null,null,null,null,"","DOISNEAU","DAMMARIE"]
[1550,null,null,null,null,"","DOISNEAU","DAMMARIE"]
[1551,null,null,null,null,"","DOISNEAU","DAMMARIE"]
[1552,null,null,null,null,"","DOISNEAU","DAMMARIE"]
[1553,null,null,null,null,"","DOISNEAU","DAMMARIE"]
[1554,null,null,null,null,"","DOISNEAU","DAMMARIE"]
[1555,null,null,null,null,"","DOISNEAU","DAMMARIE"]
[1556,null,null,null,null,"","DOISNEAU","DAMMARIE"]
[1557,null,null,null,null,"","DOISNEAU","DAMMARIE"]
[1558,null,null,null,null,"","DOISNEAU","DAMMARIE"]
[1559,null,null,null,null,"","DOISNEAU","DAMMARIE"]
[1560,null,null,null,null,"","DOISNEAU","DAMMARIE"]
[1561,null,null,null,null,"","DOISNEAU","DAMMARIE"]
[1562,null,null,null,null,"","DOISNEAU","DAMMARIE"]
[1563,null,null,null,null,"","DOISNEAU","DAMMARIE"]
[1564,null,null,null,null,"","DOISNEAU","DAMMARIE"]
[1565,null,null,null,null,"","DOISNEAU","DAMMARIE"]
[1566,null,null,null,null,"","DOISNEAU","DAMMARIE"]
[1567,null,null,null,null,"","DOISNEAU","DAMMARIE"]
[1568,null,null,null,null,"","DOISNEAU","DAMMARIE"]
[1569,null,null,null,null,"","DOISNEAU","DAMMARIE"]
[1570,null,null,null,null,"","DOISNEAU","DAMMARIE"]
[1571,null,null,null,null,"","DOISNEAU","DAMMARIE"]
[1572,null,null,null,null,"","DOISNEAU","DAMMARIE"]
[1573,null,null,null,null,"","DOISNEAU","DAMMARIE"]
[1574,null,null,null,null,"","DOISNEAU","DAMMARIE"]
[1575,null,null,null,null,"","DOISNEAU","DAMMARIE"]
[1576,null,null,null,null,"","DOISNEAU","DAMMARIE"]
[1577,null,null,null,null,"","DOISNEAU","DAMMARIE"]
[1578,null,null,null,null,"","DOISNEAU","DAMMARIE"]
[1579,null,null,null,null,"","DOISNEAU","DAMMARIE"]
[1580,null,null,null,null,"","DOISNEAU","DAMMARIE"]
[1581,null,null,null,null,"","DOISNEAU","DAMMARIE"]
[1582,null,null,null,null,"","DOISNEAU","DAMMARIE"]
[1583,null,null,null,null,"","DOISNEAU","DAMMARIE"]
[1584,null,null,null,null,"","DOISNEAU","DAMMARIE"]
[1585,null,null,null,null,"","DOISNEAU","DAMMARIE"]
[1586,null,null,null,null,"","DOISNEAU","DAMMARIE"]
[1587,null,null,null,null,"","DOISNEAU","DAMMARIE"]
[1588,null,null,null,null,"","DOISNEAU","DAMMARIE"]
[1589,null,null,null,null,"","DOISNEAU","DAMMARIE"]
[1590,null,null,null,null,"","DOISNEAU","DAMMARIE"]
[1591,null,null,null,null,"","DOISNEAU","DAMMARIE"]
[1592,null,null,null,null,"","DOISNEAU","DAMMARIE"]
[1593,null,null,null,null,"","DOISNEAU","DAMMARIE"]
[1594,null,null,null,null,"","DOISNEAU","DAMMARIE"]
[1595,null,null,null,null,"","DOISNEAU","DAMMARIE"]
[1596,null,null,null,null,"","DOISNEAU","DAMMARIE"]
[1597,null,null,null,null,"","DOISNEAU","DAMMARIE"]
[1598,null,null,null,null,"","DOISNEAU","DAMMARIE"]
[1599,null,null,null,null,"","DOISNEAU","DAMMARIE"]
[1600,null,null,null,null,"","DOISNEAU","DAMMARIE"]
[1601,null,null,null,null,{"$f":"IF(D1602=\"\",\"\",IF(E1602=\"f\",LOOKUP(D1602,cat_unss,cat_f),LOOKUP(D1602,cat_unss,cat_g)))","v":""},"DOISNEAU","DAMMARIE"]
[1602,null,null,null,null,"","DOISNEAU","DAMMARIE"]
[1603,null,null,null,null,"","DOISNEAU","DAMMARIE"]
[1604,null,null,null,null,"","DOISNEAU","DAMMARIE"]
[1605,null,null,null,null,"","DOISNEAU","DAMMARIE"]
[1606,null,null,null,null,"","DOISNEAU","DAMMARIE"]
[1607,null,null,null,null,"","DOISNEAU","DAMMARIE"]
[1608,null,null,null,null,"","DOISNEAU","DAMMARIE"]
[1609,null,null,null,null,"","DOISNEAU","DAMMARIE"]
[1610,null,null,null,null,"","DOISNEAU","DAMMARIE"]
[1611,null,null,null,null,"","DOISNEAU","DAMMARIE"]
[1612,null,null,null,null,"","DOISNEAU","DAMMARIE"]
[1613,null,null,null,null,"","DOISNEAU","DAMMARIE"]
[1614,null,null,null,null,"","DOISNEAU","DAMMARIE"]
[1615,null,null,null,null,"","DOISNEAU","DAMMARIE"]
[1616,null,null,null,null,"","DOISNEAU","DAMMARIE"]
[1617,null,null,null,null,"","DOISNEAU","DAMMARIE"]
[1618,null,null,null,null,"","DOISNEAU","DAMMARIE"]
[1619,null,null,null,null,"","DOISNEAU","DAMMARIE"]
[1620,null,null,null,null,"","DOISNEAU","DAMMARIE"]
[1621,null,null,null,null,"","DOISNEAU","DAMMARIE"]
[1622,null,null,null,null,"","DOISNEAU","DAMMARIE"]
[1623,null,null,null,null,"","DOISNEAU","DAMMARIE"]
[1624,null,null,null,null,"","DOISNEAU","DAMMARIE"]
[1625,null,null,null,null,"","DOISNEAU","DAMMARIE"]
[1626,null,null,null,null,"","DOISNEAU","DAMMARIE"]
[1627,null,null,null,null,"","DOISNEAU","DAMMARIE"]
[1628,null,null,null,null,"","DOISNEAU","DAMMARIE"]
[1629,null,null,null,null,"","DOISNEAU","DAMMARIE"]
[1630,null,null,null,null,"","DOISNEAU","DAMMARIE"]
[1631,null,null,null,null,"","DOISNEAU","DAMMARIE"]
[1632,null,null,null,null,"","DOISNEAU","DAMMARIE"]
[1633,null,null,null,null,"","DOISNEAU","DAMMARIE"]
[1634,null,null,null,null,"","DOISNEAU","DAMMARIE"]
[1635,null,null,null,null,"","DOISNEAU","DAMMARIE"]
[1636,null,null,null,null,"","DOISNEAU","DAMMARIE"]
[1637,null,null,null,null,"","DOISNEAU","DAMMARIE"]
[1638,null,null,null,null,"","DOISNEAU","DAMMARIE"]
[1639,null,null,null,null,"","DOISNEAU","DAMMARIE"]
[1640,null,null,null,null,"","DOISNEAU","DAMMARIE"]
[1641,null,null,null,null,"","DOISNEAU","DAMMARIE"]
[1642,null,null,null,null,"","DOISNEAU","DAMMARIE"]
[1643,null,null,null,null,"","DOISNEAU","DAMMARIE"]
[1644,null,null,null,null,"","DOISNEAU","DAMMARIE"]
[1645,null,null,null,null,"","DOISNEAU","DAMMARIE"]
[1646,null,null,null,null,"","DOISNEAU","DAMMARIE"]
[1647,null,null,null,null,"","DOISNEAU","DAMMARIE"]
[1648,null,null,null,null,"","DOISNEAU","DAMMARIE"]
[1649,null,null,null,null,"","DOISNEAU","DAMMARIE"]
[1650,null,null,null,null,"","DOISNEAU","DAMMARIE"]
[1651,null,null,null,null,"","DOISNEAU","DAMMARIE"]
[1652,null,null,null,null,"","DOISNEAU","DAMMARIE"]
[1653,null,null,null,null,"","DOISNEAU","DAMMARIE"]
[1654,null,null,null,null,"","DOISNEAU","DAMMARIE"]
[1655,null,null,null,null,"","DOISNEAU","DAMMARIE"]
[1656,null,null,null,null,"","DOISNEAU","DAMMARIE"]
[1657,null,null,null,null,"","DOISNEAU","DAMMARIE"]
[1658,null,null,null,null,"","DOISNEAU","DAMMARIE"]
[1659,null,null,null,null,"","DOISNEAU","DAMMARIE"]
[1660,null,null,null,null,"","DOISNEAU","DAMMARIE"]
[1661,null,null,null,null,"","DOISNEAU","DAMMARIE"]
[1662,null,null,null,null,"","DOISNEAU","DAMMARIE"]
[1663,null,null,null,null,"","DOISNEAU","DAMMARIE"]
[1664,null,null,null,null,"","DOISNEAU","DAMMARIE"]
[1665,null,null,null,null,{"$f":"IF(D1666=\"\",\"\",IF(E1666=\"f\",LOOKUP(D1666,cat_unss,cat_f),LOOKUP(D1666,cat_unss,cat_g)))","v":""},"DOISNEAU","DAMMARIE"]
[1666,null,null,null,null,"","DOISNEAU","DAMMARIE"]
[1667,null,null,null,null,"","DOISNEAU","DAMMARIE"]
[1668,null,null,null,null,"","DOISNEAU","DAMMARIE"]
[1669,null,null,null,null,"","DOISNEAU","DAMMARIE"]
[1670,null,null,null,null,"","DOISNEAU","DAMMARIE"]
[1671,null,null,null,null,"","DOISNEAU","DAMMARIE"]
[1672,null,null,null,null,"","DOISNEAU","DAMMARIE"]
[1673,null,null,null,null,"","DOISNEAU","DAMMARIE"]
[1674,null,null,null,null,"","DOISNEAU","DAMMARIE"]
[1675,null,null,null,null,"","DOISNEAU","DAMMARIE"]
[1676,null,null,null,null,"","DOISNEAU","DAMMARIE"]
[1677,null,null,null,null,"","DOISNEAU","DAMMARIE"]
[1678,null,null,null,null,"","DOISNEAU","DAMMARIE"]
[1679,null,null,null,null,"","DOISNEAU","DAMMARIE"]
[1680,null,null,null,null,"","DOISNEAU","DAMMARIE"]
[1681,null,null,null,null,"","DOISNEAU","DAMMARIE"]
[1682,null,null,null,null,"","DOISNEAU","DAMMARIE"]
[1683,null,null,null,null,"","DOISNEAU","DAMMARIE"]
[1684,null,null,null,null,"","DOISNEAU","DAMMARIE"]
[1685,null,null,null,null,"","DOISNEAU","DAMMARIE"]
[1686,null,null,null,null,"","DOISNEAU","DAMMARIE"]
[1687,null,null,null,null,"","DOISNEAU","DAMMARIE"]
[1688,null,null,null,null,"","DOISNEAU","DAMMARIE"]
[1689,null,null,null,null,"","DOISNEAU","DAMMARIE"]
[1690,null,null,null,null,"","DOISNEAU","DAMMARIE"]
[1691,null,null,null,null,"","DOISNEAU","DAMMARIE"]
[1692,null,null,null,null,"","DOISNEAU","DAMMARIE"]
[1693,null,null,null,null,"","DOISNEAU","DAMMARIE"]
[1694,null,null,null,null,"","DOISNEAU","DAMMARIE"]
[1695,null,null,null,null,"","DOISNEAU","DAMMARIE"]
[1696,null,null,null,null,"","DOISNEAU","DAMMARIE"]
[1697,null,null,null,null,"","DOISNEAU","DAMMARIE"]
[1698,null,null,null,null,"","DOISNEAU","DAMMARIE"]
[1699,null,null,null,null,"","DOISNEAU","DAMMARIE"]
[1700,null,null,null,null,"","DOISNEAU","DAMMARIE"]
[1701,null,null,null,null,"","DOISNEAU","DAMMARIE"]
[1702,null,null,null,null,"","DOISNEAU","DAMMARIE"]
[1703,null,null,null,null,"","DOISNEAU","DAMMARIE"]
[1704,null,null,null,null,"","DOISNEAU","DAMMARIE"]
[1705,null,null,null,null,"","DOISNEAU","DAMMARIE"]
[1706,null,null,null,null,"","DOISNEAU","DAMMARIE"]
[1707,null,null,null,null,"","DOISNEAU","DAMMARIE"]
[1708,null,null,null,null,"","DOISNEAU","DAMMARIE"]
[1709,null,null,null,null,"","DOISNEAU","DAMMARIE"]
[1710,null,null,null,null,"","DOISNEAU","DAMMARIE"]
[1711,null,null,null,null,"","DOISNEAU","DAMMARIE"]
[1712,null,null,null,null,"","DOISNEAU","DAMMARIE"]
[1713,null,null,null,null,"","DOISNEAU","DAMMARIE"]
[1714,null,null,null,null,"","DOISNEAU","DAMMARIE"]
[1715,null,null,null,null,"","DOISNEAU","DAMMARIE"]
[1716,null,null,null,null,"","DOISNEAU","DAMMARIE"]
[1717,null,null,null,null,"","DOISNEAU","DAMMARIE"]
[1718,null,null,null,null,"","DOISNEAU","DAMMARIE"]
[1719,null,null,null,null,"","DOISNEAU","DAMMARIE"]
[1720,null,null,null,null,"","DOISNEAU","DAMMARIE"]
[1721,null,null,null,null,"","DOISNEAU","DAMMARIE"]
[1722,null,null,null,null,"","DOISNEAU","DAMMARIE"]
[1723,null,null,null,null,"","DOISNEAU","DAMMARIE"]
[1724,null,null,null,null,"","DOISNEAU","DAMMARIE"]
[1725,null,null,null,null,"","DOISNEAU","DAMMARIE"]
[1726,null,null,null,null,"","DOISNEAU","DAMMARIE"]
[1727,null,null,null,null,"","DOISNEAU","DAMMARIE"]
[1728,null,null,null,null,"","DOISNEAU","DAMMARIE"]
[1729,null,null,null,null,{"$f":"IF(D1730=\"\",\"\",IF(E1730=\"f\",LOOKUP(D1730,cat_unss,cat_f),LOOKUP(D1730,cat_unss,cat_g)))","v":""},"DOISNEAU","DAMMARIE"]
[1730,null,null,null,null,"","DOISNEAU","DAMMARIE"]
[1731,null,null,null,null,"","DOISNEAU","DAMMARIE"]
[1732,null,null,null,null,"","DOISNEAU","DAMMARIE"]
[1733,null,null,null,null,"","DOISNEAU","DAMMARIE"]
[1734,null,null,null,null,"","DOISNEAU","DAMMARIE"]
[1735,null,null,null,null,"","DOISNEAU","DAMMARIE"]
[1736,null,null,null,null,"","DOISNEAU","DAMMARIE"]
[1737,null,null,null,null,"","DOISNEAU","DAMMARIE"]
[1738,null,null,null,null,"","DOISNEAU","DAMMARIE"]
[1739,null,null,null,null,"","DOISNEAU","DAMMARIE"]
[1740,null,null,null,null,"","DOISNEAU","DAMMARIE"]
[1741,null,null,null,null,"","DOISNEAU","DAMMARIE"]
[1742,null,null,null,null,"","DOISNEAU","DAMMARIE"]
[1743,null,null,null,null,"","DOISNEAU","DAMMARIE"]
[1744,null,null,null,null,"","DOISNEAU","DAMMARIE"]
[1745,null,null,null,null,"","DOISNEAU","DAMMARIE"]
[1746,null,null,null,null,"","DOISNEAU","DAMMARIE"]
[1747,null,null,null,null,"","DOISNEAU","DAMMARIE"]
[1748,null,null,null,null,"","DOISNEAU","DAMMARIE"]
[1749,null,null,null,null,"","DOISNEAU","DAMMARIE"]
[1750,null,null,null,null,"","DOISNEAU","DAMMARIE"]
[1751,null,null,null,null,"","DOISNEAU","DAMMARIE"]
[1752,null,null,null,null,"","DOISNEAU","DAMMARIE"]
[1753,null,null,null,null,"","DOISNEAU","DAMMARIE"]
[1754,null,null,null,null,"","DOISNEAU","DAMMARIE"]
[1755,null,null,null,null,"","DOISNEAU","DAMMARIE"]
[1756,null,null,null,null,"","DOISNEAU","DAMMARIE"]
[1757,null,null,null,null,"","DOISNEAU","DAMMARIE"]
[1758,null,null,null,null,"","DOISNEAU","DAMMARIE"]
[1759,null,null,null,null,"","DOISNEAU","DAMMARIE"]
[1760,null,null,null,null,"","DOISNEAU","DAMMARIE"]
[1761,null,null,null,null,"","DOISNEAU","DAMMARIE"]
[1762,null,null,null,null,"","DOISNEAU","DAMMARIE"]
[1763,null,null,null,null,"","DOISNEAU","DAMMARIE"]
[1764,null,null,null,null,"","DOISNEAU","DAMMARIE"]
[1765,null,null,null,null,"","DOISNEAU","DAMMARIE"]
[1766,null,null,null,null,"","DOISNEAU","DAMMARIE"]
[1767,null,null,null,null,"","DOISNEAU","DAMMARIE"]
[1768,null,null,null,null,"","DOISNEAU","DAMMARIE"]
[1769,null,null,null,null,"","DOISNEAU","DAMMARIE"]
[1770,null,null,null,null,"","DOISNEAU","DAMMARIE"]
[1771,null,null,null,null,"","DOISNEAU","DAMMARIE"]
[1772,null,null,null,null,"","DOISNEAU","DAMMARIE"]
[1773,null,null,null,null,"","DOISNEAU","DAMMARIE"]
[1774,null,null,null,null,"","DOISNEAU","DAMMARIE"]
[1775,null,null,null,null,"","DOISNEAU","DAMMARIE"]
[1776,null,null,null,null,"","DOISNEAU","DAMMARIE"]
[1777,null,null,null,null,"","DOISNEAU","DAMMARIE"]
[1778,null,null,null,null,"","DOISNEAU","DAMMARIE"]
[1779,null,null,null,null,"","DOISNEAU","DAMMARIE"]
[1780,null,null,null,null,"","DOISNEAU","DAMMARIE"]
[1781,null,null,null,null,"","DOISNEAU","DAMMARIE"]
[1782,null,null,null,null,"","DOISNEAU","DAMMARIE"]
[1783,null,null,null,null,"","DOISNEAU","DAMMARIE"]
[1784,null,null,null,null,"","DOISNEAU","DAMMARIE"]
[1785,null,null,null,null,"","DOISNEAU","DAMMARIE"]
[1786,null,null,null,null,"","DOISNEAU","DAMMARIE"]
[1787,null,null,null,null,"","DOISNEAU","DAMMARIE"]
[1788,null,null,null,null,"","DOISNEAU","DAMMARIE"]
[1789,null,null,null,null,"","DOISNEAU","DAMMARIE"]
[1790,null,null,null,null,"","DOISNEAU","DAMMARIE"]
[1791,null,null,null,null,"","DOISNEAU","DAMMARIE"]
[1792,null,null,null,null,"","DOISNEAU","DAMMARIE"]
[1793,null,null,null,null,{"$f":"IF(D1794=\"\",\"\",IF(E1794=\"f\",LOOKUP(D1794,cat_unss,cat_f),LOOKUP(D1794,cat_unss,cat_g)))","v":""},"DOISNEAU","DAMMARIE"]
[1794,null,null,null,null,"","DOISNEAU","DAMMARIE"]
[1795,null,null,null,null,"","DOISNEAU","DAMMARIE"]
[1796,null,null,null,null,"","DOISNEAU","DAMMARIE"]
[1797,null,null,null,null,"","DOISNEAU","DAMMARIE"]
[1798,null,null,null,null,"","DOISNEAU","DAMMARIE"]
[1799,null,null,null,null,"","DOISNEAU","DAMMARIE"]
[1800,null,null,null,null,"","DOISNEAU","DAMMARIE"]
[1801,"FAHIM","Zinab",2001,"F","CF","ELSA TRIOLET","LE MEE"]
[1802,"NZUZI","Priscilla",2002,"F","MF","ELSA TRIOLET","LE MEE"]
[1803,"LUSUEKIKIO","Bénédicte",2002,"F","MF","ELSA TRIOLET","LE MEE"]
[1804,"BREHE","Djeuneba",2002,"F","MF","ELSA TRIOLET","LE MEE"]
[1805,"OKOKO","Soraya",2002,"F","MF","ELSA TRIOLET","LE MEE"]
[1806,"SENDRON","Delphine",2002,"F","MF","ELSA TRIOLET","LE MEE"]
[1807,"ARZUR","Alison",2002,"F","MF","ELSA TRIOLET","LE MEE"]
[1808,"CORNOLLE","Cassandra",2001,"F","CF","ELSA TRIOLET","LE MEE"]
[1809,"SZEWCZUK","Elodie",2002,"F","MF","ELSA TRIOLET","LE MEE"]
[1810,"ZAKI","Mahnaz",2001,"F","CF","ELSA TRIOLET","LE MEE"]
[1811,"MOREIRA DA VEIGA","Bélone",2002,"G","MG","ELSA TRIOLET","LE MEE"]
[1812,"NZABA","Jenny",2001,"G","CG","ELSA TRIOLET","LE MEE"]
[1813,"ANTONIO","Moise",2002,"G","MG","ELSA TRIOLET","LE MEE"]
[1814,"SALABERT-FEAT","Erwan",2002,"G","MG","ELSA TRIOLET","LE MEE"]
[1815,"NDABA","Mandjolo",2001,"G","CG","ELSA TRIOLET","LE MEE"]
[1816,"DIKUTALA NIAPUDRE","Christvie",2002,"G","MG","ELSA TRIOLET","LE MEE"]
[1817,"DIABY","Mahamadou",2002,"G","MG","ELSA TRIOLET","LE MEE"]
[1818,"YILMAZ","Azad",2002,"G","MG","ELSA TRIOLET","LE MEE"]
[1819,"SISSOKO","Bakary",2001,"G","CG","ELSA TRIOLET","LE MEE"]
[1820,"ANDRY","Vincent",2002,"G","MG","ELSA TRIOLET","LE MEE"]
[1821,"THOMAS","Naomi",2003,"F","MF","ELSA TRIOLET","LE MEE"]
[1822,"BIRON-ERHARD","Maïlys",2003,"F","MF","ELSA TRIOLET","LE MEE"]
[1823,"VILLAIN","Tatiana",2003,"F","MF","ELSA TRIOLET","LE MEE"]
[1824,"FATAKI-MUNDE","Victoria",2003,"F","MF","ELSA TRIOLET","LE MEE"]
[1825,"BENALI","Marie",2003,"F","MF","ELSA TRIOLET","LE MEE"]
[1826,"MALO","Maelys",2003,"F","MF","ELSA TRIOLET","LE MEE"]
[1827,"LABBEZ","Thiphaine",2003,"F","MF","ELSA TRIOLET","LE MEE"]
[1828,"NDANGI","Léa",2003,"F","MF","ELSA TRIOLET","LE MEE"]
[1829,"TISSIER","Oriane",2003,"F","MF","ELSA TRIOLET","LE MEE"]
[1830,"JAOUAL","Rim",2003,"F","MF","ELSA TRIOLET","LE MEE"]
[1831,"ZEMMOURI","Benamar",2003,"G","MG","ELSA TRIOLET","LE MEE"]
[1832,"TUGRUL","Berkant",2003,"G","MG","ELSA TRIOLET","LE MEE"]
[1833,"CILPA","Louis-Jacques",2003,"G","MG","ELSA TRIOLET","LE MEE"]
[1834,"HADBI","Walid",2003,"G","MG","ELSA TRIOLET","LE MEE"]
[1835,"N'GAMBOU","Axel",2003,"G","MG","ELSA TRIOLET","LE MEE"]
[1836,"PALIX","Darryl",2003,"G","MG","ELSA TRIOLET","LE MEE"]
[1837,"RAMOUL","Malik",2003,"G","MG","ELSA TRIOLET","LE MEE"]
[1838,"GEBREMARIAM","Amaniel",2002,"G","MG","ELSA TRIOLET","LE MEE"]
[1839,"BETTIOUI","Ihsane",2003,"G","MG","ELSA TRIOLET","LE MEE"]
[1840,"MUTATA MUHOYA","Christian",2003,"G","MG","ELSA TRIOLET","LE MEE"]
[1841,"ATTIK","Sarah",2004,"F","BF2","ELSA TRIOLET","LE MEE"]
[1842,"BERCEGER","Elodie",2004,"F","BF2","ELSA TRIOLET","LE MEE"]
[1843,"EL MAZIANI","Sabrina",2004,"F","BF2","ELSA TRIOLET","LE MEE"]
[1844,"GUILLOCHON","Imane",2004,"F","BF2","ELSA TRIOLET","LE MEE"]
[1845,"FALCHI- LE BARS","Inés",2004,"F","BF2","ELSA TRIOLET","LE MEE"]
[1846,"FATAKI-MUNDE","Souria",2004,"F","BF2","ELSA TRIOLET","LE MEE"]
[1847,"NSONGO","Lysa",2004,"F","BF2","ELSA TRIOLET","LE MEE"]
[1848,"MANZOLO MOSEKA","Sonia",2004,"F","BF2","ELSA TRIOLET","LE MEE"]
[1849,"CISSE","Salimata",2003,"F","MF","ELSA TRIOLET","LE MEE"]
[1850,"BARA","Jenna",2004,"F","BF2","ELSA TRIOLET","LE MEE"]
[1851,"FELIX","Samuel",2004,"G","BG2","ELSA TRIOLET","LE MEE"]
[1852,"ZADRAN","Muhammad Usman",2004,"G","BG2","ELSA TRIOLET","LE MEE"]
[1853,"MICHELETTI","Dyron",2004,"G","BG2","ELSA TRIOLET","LE MEE"]
[1854,"MALANDA","Isaac",2004,"G","BG2","ELSA TRIOLET","LE MEE"]
[1855,"DUVERNOY","Romain",2004,"G","BG2","ELSA TRIOLET","LE MEE"]
[1856,"SEVER","Kawa",2003,"G","MG","ELSA TRIOLET","LE MEE"]
[1857,"DOS SANTOS","Raphaël",2004,"G",{"$f":"IF(D1858=\"\",\"\",IF(E1858=\"f\",LOOKUP(D1858,cat_unss,cat_f),LOOKUP(D1858,cat_unss,cat_g)))","v":"BG2"},"ELSA TRIOLET","LE MEE"]
[1858,"BAYA","Erwan",2004,"G","BG2","ELSA TRIOLET","LE MEE"]
[1859,"ISMAEL","Belaid",2004,"G","BG2","ELSA TRIOLET","LE MEE"]
[1860,"MOUSSITA BAKOUSSOU","Bitsidou",2004,"G","BG2","ELSA TRIOLET","LE MEE"]
[1861,"EL MAZIANI","Fatima",2005,"F","BF1","ELSA TRIOLET","LE MEE"]
[1862,"RAMOUL","Fatimazahra",2005,"F","BF1","ELSA TRIOLET","LE MEE"]
[1863,"HENDA","Farah",2005,"F","BF1","ELSA TRIOLET","LE MEE"]
[1864,"BARA","Maéva-Jayne",2005,"F","BF1","ELSA TRIOLET","LE MEE"]
[1865,"BELBAGRA","Chaïma",2005,"F","BF1","ELSA TRIOLET","LE MEE"]
[1866,"SALABERT FEAT","Tara",2005,"F","BF1","ELSA TRIOLET","LE MEE"]
[1867,"THOO","Oriane",2005,"F","BF1","ELSA TRIOLET","LE MEE"]
[1868,"HADJI","Lina",2005,"F","BF1","ELSA TRIOLET","LE MEE"]
[1869,"ROBERT","LéA",2005,"F","BF1","ELSA TRIOLET","LE MEE"]
[1870,"HEURTEAUX","Lydie",2005,"F","BF1","ELSA TRIOLET","LE MEE"]
[1871,"LOUGBEGNON","Marvin",2005,"G","BG1","ELSA TRIOLET","LE MEE"]
[1872,"DUCROTOY","Tristan",2005,"G","BG1","ELSA TRIOLET","LE MEE"]
[1873,"HANDALA","Adam",2004,"G","BG2","ELSA TRIOLET","LE MEE"]
[1874,"HIMMER","Sherydan",2005,"G","BG1","ELSA TRIOLET","LE MEE"]
[1875,"PEREGUDOV","Steven",2004,"G","BG2","ELSA TRIOLET","LE MEE"]
[1876,"GARAUD-RAKOTONIAINA","Enzo",2005,"G","BG1","ELSA TRIOLET","LE MEE"]
[1877,"IVANCIU","Florin",2005,"G","BG1","ELSA TRIOLET","LE MEE"]
[1878,"DESALLON","Tyron",2004,"G","BG2","ELSA TRIOLET","LE MEE"]
[1879,"N'SONGO","Yoan",2005,"G","BG1","ELSA TRIOLET","LE MEE"]
[1880,"MAKELA","Ridge",2005,"G","BG1","ELSA TRIOLET","LE MEE"]
[1881,"EL HAFIDI","Salma",2005,"F","BF1","ELSA TRIOLET","LE MEE"]
[1882,"JANVIER","Sarah",2005,"F","BF1","ELSA TRIOLET","LE MEE"]
[1883,"OUALI","Chahinez",2005,"F","BF1","ELSA TRIOLET","LE MEE"]
[1884,"NOUGA NOUGA","Divine",2005,"F","BF1","ELSA TRIOLET","LE MEE"]
[1885,"ABRAHAM","Iswaree",2005,"F","BF1","ELSA TRIOLET","LE MEE"]
[1886,"KATHIRAVELU","Hajeen",2005,"G","BG1","ELSA TRIOLET","LE MEE"]
[1887,"DAIZE","Brice",2005,"G","BG1","ELSA TRIOLET","LE MEE"]
[1888,"POUGET","Quentin",2005,"G","BG1","ELSA TRIOLET","LE MEE"]
[1889,"RAMDANE","Malika",2003,"F","MF","ELSA TRIOLET","LE MEE"]
[1890,null,null,null,null,"","ELSA TRIOLET","LE MEE"]
[1891,null,null,null,null,"","ELSA TRIOLET","LE MEE"]
[1892,null,null,null,null,"","ELSA TRIOLET","LE MEE"]
[1893,null,null,null,null,"","ELSA TRIOLET","LE MEE"]
[1894,null,null,null,null,"","ELSA TRIOLET","LE MEE"]
[1895,null,null,null,null,"","ELSA TRIOLET","LE MEE"]
[1896,null,null,null,null,"","ELSA TRIOLET","LE MEE"]
[1897,null,null,null,null,"","ELSA TRIOLET","LE MEE"]
[1898,null,null,null,null,"","ELSA TRIOLET","LE MEE"]
[1899,null,null,null,null,"","ELSA TRIOLET","LE MEE"]
[1900,null,null,null,null,"","ELSA TRIOLET","LE MEE"]
[1901,null,null,null,null,"","ELSA TRIOLET","LE MEE"]
[1902,null,null,null,null,"","ELSA TRIOLET","LE MEE"]
[1903,null,null,null,null,"","ELSA TRIOLET","LE MEE"]
[1904,null,null,null,null,"","ELSA TRIOLET","LE MEE"]
[1905,null,null,null,null,"","ELSA TRIOLET","LE MEE"]
[1906,null,null,null,null,"","ELSA TRIOLET","LE MEE"]
[1907,null,null,null,null,"","ELSA TRIOLET","LE MEE"]
[1908,null,null,null,null,"","ELSA TRIOLET","LE MEE"]
[1909,null,null,null,null,"","ELSA TRIOLET","LE MEE"]
[1910,null,null,null,null,"","ELSA TRIOLET","LE MEE"]
[1911,null,null,null,null,"","ELSA TRIOLET","LE MEE"]
[1912,null,null,null,null,"","ELSA TRIOLET","LE MEE"]
[1913,null,null,null,null,"","ELSA TRIOLET","LE MEE"]
[1914,null,null,null,null,"","ELSA TRIOLET","LE MEE"]
[1915,null,null,null,null,"","ELSA TRIOLET","LE MEE"]
[1916,null,null,null,null,"","ELSA TRIOLET","LE MEE"]
[1917,null,null,null,null,"","ELSA TRIOLET","LE MEE"]
[1918,null,null,null,null,"","ELSA TRIOLET","LE MEE"]
[1919,null,null,null,null,"","ELSA TRIOLET","LE MEE"]
[1920,null,null,null,null,"","ELSA TRIOLET","LE MEE"]
[1921,null,null,null,null,{"$f":"IF(D1922=\"\",\"\",IF(E1922=\"f\",LOOKUP(D1922,cat_unss,cat_f),LOOKUP(D1922,cat_unss,cat_g)))","v":""},"ELSA TRIOLET","LE MEE"]
[1922,null,null,null,null,"","ELSA TRIOLET","LE MEE"]
[1923,null,null,null,null,"","ELSA TRIOLET","LE MEE"]
[1924,null,null,null,null,"","ELSA TRIOLET","LE MEE"]
[1925,null,null,null,null,"","ELSA TRIOLET","LE MEE"]
[1926,null,null,null,null,"","ELSA TRIOLET","LE MEE"]
[1927,null,null,null,null,"","ELSA TRIOLET","LE MEE"]
[1928,null,null,null,null,"","ELSA TRIOLET","LE MEE"]
[1929,null,null,null,null,"","ELSA TRIOLET","LE MEE"]
[1930,null,null,null,null,"","ELSA TRIOLET","LE MEE"]
[1931,null,null,null,null,"","ELSA TRIOLET","LE MEE"]
[1932,null,null,null,null,"","ELSA TRIOLET","LE MEE"]
[1933,null,null,null,null,"","ELSA TRIOLET","LE MEE"]
[1934,null,null,null,null,"","ELSA TRIOLET","LE MEE"]
[1935,null,null,null,null,"","ELSA TRIOLET","LE MEE"]
[1936,null,null,null,null,"","ELSA TRIOLET","LE MEE"]
[1937,null,null,null,null,"","ELSA TRIOLET","LE MEE"]
[1938,null,null,null,null,"","ELSA TRIOLET","LE MEE"]
[1939,null,null,null,null,"","ELSA TRIOLET","LE MEE"]
[1940,null,null,null,null,"","ELSA TRIOLET","LE MEE"]
[1941,null,null,null,null,"","ELSA TRIOLET","LE MEE"]
[1942,null,null,null,null,"","ELSA TRIOLET","LE MEE"]
[1943,null,null,null,null,"","ELSA TRIOLET","LE MEE"]
[1944,null,null,null,null,"","ELSA TRIOLET","LE MEE"]
[1945,null,null,null,null,"","ELSA TRIOLET","LE MEE"]
[1946,null,null,null,null,"","ELSA TRIOLET","LE MEE"]
[1947,null,null,null,null,"","ELSA TRIOLET","LE MEE"]
[1948,null,null,null,null,"","ELSA TRIOLET","LE MEE"]
[1949,null,null,null,null,"","ELSA TRIOLET","LE MEE"]
[1950,null,null,null,null,"","ELSA TRIOLET","LE MEE"]
[1951,null,null,null,null,"","ELSA TRIOLET","LE MEE"]
[1952,null,null,null,null,"","ELSA TRIOLET","LE MEE"]
[1953,null,null,null,null,"","ELSA TRIOLET","LE MEE"]
[1954,null,null,null,null,"","ELSA TRIOLET","LE MEE"]
[1955,null,null,null,null,"","ELSA TRIOLET","LE MEE"]
[1956,null,null,null,null,"","ELSA TRIOLET","LE MEE"]
[1957,null,null,null,null,"","ELSA TRIOLET","LE MEE"]
[1958,null,null,null,null,"","ELSA TRIOLET","LE MEE"]
[1959,null,null,null,null,"","ELSA TRIOLET","LE MEE"]
[1960,null,null,null,null,"","ELSA TRIOLET","LE MEE"]
[1961,null,null,null,null,"","ELSA TRIOLET","LE MEE"]
[1962,null,null,null,null,"","ELSA TRIOLET","LE MEE"]
[1963,null,null,null,null,"","ELSA TRIOLET","LE MEE"]
[1964,null,null,null,null,"","ELSA TRIOLET","LE MEE"]
[1965,null,null,null,null,"","ELSA TRIOLET","LE MEE"]
[1966,null,null,null,null,"","ELSA TRIOLET","LE MEE"]
[1967,null,null,null,null,"","ELSA TRIOLET","LE MEE"]
[1968,null,null,null,null,"","ELSA TRIOLET","LE MEE"]
[1969,null,null,null,null,"","ELSA TRIOLET","LE MEE"]
[1970,null,null,null,null,"","ELSA TRIOLET","LE MEE"]
[1971,null,null,null,null,"","ELSA TRIOLET","LE MEE"]
[1972,null,null,null,null,"","ELSA TRIOLET","LE MEE"]
[1973,null,null,null,null,"","ELSA TRIOLET","LE MEE"]
[1974,null,null,null,null,"","ELSA TRIOLET","LE MEE"]
[1975,null,null,null,null,"","ELSA TRIOLET","LE MEE"]
[1976,null,null,null,null,"","ELSA TRIOLET","LE MEE"]
[1977,null,null,null,null,"","ELSA TRIOLET","LE MEE"]
[1978,null,null,null,null,"","ELSA TRIOLET","LE MEE"]
[1979,null,null,null,null,"","ELSA TRIOLET","LE MEE"]
[1980,null,null,null,null,"","ELSA TRIOLET","LE MEE"]
[1981,null,null,null,null,"","ELSA TRIOLET","LE MEE"]
[1982,null,null,null,null,"","ELSA TRIOLET","LE MEE"]
[1983,null,null,null,null,"","ELSA TRIOLET","LE MEE"]
[1984,null,null,null,null,"","ELSA TRIOLET","LE MEE"]
[1985,null,null,null,null,{"$f":"IF(D1986=\"\",\"\",IF(E1986=\"f\",LOOKUP(D1986,cat_unss,cat_f),LOOKUP(D1986,cat_unss,cat_g)))","v":""},"ELSA TRIOLET","LE MEE"]
[1986,null,null,null,null,"","ELSA TRIOLET","LE MEE"]
[1987,null,null,null,null,"","ELSA TRIOLET","LE MEE"]
[1988,null,null,null,null,"","ELSA TRIOLET","LE MEE"]
[1989,null,null,null,null,"","ELSA TRIOLET","LE MEE"]
[1990,null,null,null,null,"","ELSA TRIOLET","LE MEE"]
[1991,null,null,null,null,"","ELSA TRIOLET","LE MEE"]
[1992,null,null,null,null,"","ELSA TRIOLET","LE MEE"]
[1993,null,null,null,null,"","ELSA TRIOLET","LE MEE"]
[1994,null,null,null,null,"","ELSA TRIOLET","LE MEE"]
[1995,null,null,null,null,"","ELSA TRIOLET","LE MEE"]
[1996,null,null,null,null,"","ELSA TRIOLET","LE MEE"]
[1997,null,null,null,null,"","ELSA TRIOLET","LE MEE"]
[1998,null,null,null,null,"","ELSA TRIOLET","LE MEE"]
[1999,null,null,null,null,"","ELSA TRIOLET","LE MEE"]
[2000,null,null,null,null,"","ELSA TRIOLET","LE MEE"]
[2001,null,null,null,null,"","ELSA TRIOLET","LE MEE"]
[2002,null,null,null,null,"","ELSA TRIOLET","LE MEE"]
[2003,null,null,null,null,"","ELSA TRIOLET","LE MEE"]
[2004,null,null,null,null,"","ELSA TRIOLET","LE MEE"]
[2005,null,null,null,null,"","ELSA TRIOLET","LE MEE"]
[2006,null,null,null,null,"","ELSA TRIOLET","LE MEE"]
[2007,null,null,null,null,"","ELSA TRIOLET","LE MEE"]
[2008,null,null,null,null,"","ELSA TRIOLET","LE MEE"]
[2009,null,null,null,null,"","ELSA TRIOLET","LE MEE"]
[2010,null,null,null,null,"","ELSA TRIOLET","LE MEE"]
[2011,null,null,null,null,"","ELSA TRIOLET","LE MEE"]
[2012,null,null,null,null,"","ELSA TRIOLET","LE MEE"]
[2013,null,null,null,null,"","ELSA TRIOLET","LE MEE"]
[2014,null,null,null,null,"","ELSA TRIOLET","LE MEE"]
[2015,null,null,null,null,"","ELSA TRIOLET","LE MEE"]
[2016,null,null,null,null,"","ELSA TRIOLET","LE MEE"]
[2017,null,null,null,null,"","ELSA TRIOLET","LE MEE"]
[2018,null,null,null,null,"","ELSA TRIOLET","LE MEE"]
[2019,null,null,null,null,"","ELSA TRIOLET","LE MEE"]
[2020,null,null,null,null,"","ELSA TRIOLET","LE MEE"]
[2021,null,null,null,null,"","ELSA TRIOLET","LE MEE"]
[2022,null,null,null,null,"","ELSA TRIOLET","LE MEE"]
[2023,null,null,null,null,"","ELSA TRIOLET","LE MEE"]
[2024,null,null,null,null,"","ELSA TRIOLET","LE MEE"]
[2025,null,null,null,null,"","ELSA TRIOLET","LE MEE"]
[2026,null,null,null,null,"","ELSA TRIOLET","LE MEE"]
[2027,null,null,null,null,"","ELSA TRIOLET","LE MEE"]
[2028,null,null,null,null,"","ELSA TRIOLET","LE MEE"]
[2029,null,null,null,null,"","ELSA TRIOLET","LE MEE"]
[2030,null,null,null,null,"","ELSA TRIOLET","LE MEE"]
[2031,null,null,null,null,"","ELSA TRIOLET","LE MEE"]
[2032,null,null,null,null,"","ELSA TRIOLET","LE MEE"]
[2033,null,null,null,null,"","ELSA TRIOLET","LE MEE"]
[2034,null,null,null,null,"","ELSA TRIOLET","LE MEE"]
[2035,null,null,null,null,"","ELSA TRIOLET","LE MEE"]
[2036,null,null,null,null,"","ELSA TRIOLET","LE MEE"]
[2037,null,null,null,null,"","ELSA TRIOLET","LE MEE"]
[2038,null,null,null,null,"","ELSA TRIOLET","LE MEE"]
[2039,null,null,null,null,"","ELSA TRIOLET","LE MEE"]
[2040,null,null,null,null,"","ELSA TRIOLET","LE MEE"]
[2041,null,null,null,null,"","ELSA TRIOLET","LE MEE"]
[2042,null,null,null,null,"","ELSA TRIOLET","LE MEE"]
[2043,null,null,null,null,"","ELSA TRIOLET","LE MEE"]
[2044,null,null,null,null,"","ELSA TRIOLET","LE MEE"]
[2045,null,null,null,null,"","ELSA TRIOLET","LE MEE"]
[2046,null,null,null,null,"","ELSA TRIOLET","LE MEE"]
[2047,null,null,null,null,"","ELSA TRIOLET","LE MEE"]
[2048,null,null,null,null,"","ELSA TRIOLET","LE MEE"]
[2049,null,null,null,null,{"$f":"IF(D2050=\"\",\"\",IF(E2050=\"f\",LOOKUP(D2050,cat_unss,cat_f),LOOKUP(D2050,cat_unss,cat_g)))","v":""},"ELSA TRIOLET","LE MEE"]
[2050,null,null,null,null,"","ELSA TRIOLET","LE MEE"]
[2051,null,null,null,null,"","ELSA TRIOLET","LE MEE"]
[2052,null,null,null,null,"","ELSA TRIOLET","LE MEE"]
[2053,null,null,null,null,"","ELSA TRIOLET","LE MEE"]
[2054,null,null,null,null,"","ELSA TRIOLET","LE MEE"]
[2055,null,null,null,null,"","ELSA TRIOLET","LE MEE"]
[2056,null,null,null,null,"","ELSA TRIOLET","LE MEE"]
[2057,null,null,null,null,"","ELSA TRIOLET","LE MEE"]
[2058,null,null,null,null,"","ELSA TRIOLET","LE MEE"]
[2059,null,null,null,null,"","ELSA TRIOLET","LE MEE"]
[2060,null,null,null,null,"","ELSA TRIOLET","LE MEE"]
[2061,null,null,null,null,"","ELSA TRIOLET","LE MEE"]
[2062,null,null,null,null,"","ELSA TRIOLET","LE MEE"]
[2063,null,null,null,null,"","ELSA TRIOLET","LE MEE"]
[2064,null,null,null,null,"","ELSA TRIOLET","LE MEE"]
[2065,null,null,null,null,"","ELSA TRIOLET","LE MEE"]
[2066,null,null,null,null,"","ELSA TRIOLET","LE MEE"]
[2067,null,null,null,null,"","ELSA TRIOLET","LE MEE"]
[2068,null,null,null,null,"","ELSA TRIOLET","LE MEE"]
[2069,null,null,null,null,"","ELSA TRIOLET","LE MEE"]
[2070,null,null,null,null,"","ELSA TRIOLET","LE MEE"]
[2071,null,null,null,null,"","ELSA TRIOLET","LE MEE"]
[2072,null,null,null,null,"","ELSA TRIOLET","LE MEE"]
[2073,null,null,null,null,"","ELSA TRIOLET","LE MEE"]
[2074,null,null,null,null,"","ELSA TRIOLET","LE MEE"]
[2075,null,null,null,null,"","ELSA TRIOLET","LE MEE"]
[2076,null,null,null,null,"","ELSA TRIOLET","LE MEE"]
[2077,null,null,null,null,"","ELSA TRIOLET","LE MEE"]
[2078,null,null,null,null,"","ELSA TRIOLET","LE MEE"]
[2079,null,null,null,null,"","ELSA TRIOLET","LE MEE"]
[2080,null,null,null,null,"","ELSA TRIOLET","LE MEE"]
[2081,null,null,null,null,"","ELSA TRIOLET","LE MEE"]
[2082,null,null,null,null,"","ELSA TRIOLET","LE MEE"]
[2083,null,null,null,null,"","ELSA TRIOLET","LE MEE"]
[2084,null,null,null,null,"","ELSA TRIOLET","LE MEE"]
[2085,null,null,null,null,"","ELSA TRIOLET","LE MEE"]
[2086,null,null,null,null,"","ELSA TRIOLET","LE MEE"]
[2087,null,null,null,null,"","ELSA TRIOLET","LE MEE"]
[2088,null,null,null,null,"","ELSA TRIOLET","LE MEE"]
[2089,null,null,null,null,"","ELSA TRIOLET","LE MEE"]
[2090,null,null,null,null,"","ELSA TRIOLET","LE MEE"]
[2091,null,null,null,null,"","ELSA TRIOLET","LE MEE"]
[2092,null,null,null,null,"","ELSA TRIOLET","LE MEE"]
[2093,null,null,null,null,"","ELSA TRIOLET","LE MEE"]
[2094,null,null,null,null,"","ELSA TRIOLET","LE MEE"]
[2095,null,null,null,null,"","ELSA TRIOLET","LE MEE"]
[2096,null,null,null,null,"","ELSA TRIOLET","LE MEE"]
[2097,null,null,null,null,"","ELSA TRIOLET","LE MEE"]
[2098,null,null,null,null,"","ELSA TRIOLET","LE MEE"]
[2099,null,null,null,null,"","ELSA TRIOLET","LE MEE"]
[2100,null,null,null,null,"","ELSA TRIOLET","LE MEE"]
[2101,"KIMPE KOMBE","Davina",2005,"F","BF1","F VILLON","PONTHIERRY"]
[2102,"NAGAUD","Lauriane",2005,"F","BF1","F VILLON","PONTHIERRY"]
[2103,"BLOT","Axelle",2004,"F","BF2","F VILLON","PONTHIERRY"]
[2104,"FURLANETTO","Margaux",2005,"F","BF1","F VILLON","PONTHIERRY"]
[2105,"KIMPIOKA","Zayan",2005,"G","BG1","F VILLON","PONTHIERRY"]
[2106,"KUNZALA","Benjamin",2004,"G","BG2","F VILLON","PONTHIERRY"]
[2107,"BRUIANT","Antonin",2004,"G","BG2","F VILLON","PONTHIERRY"]
[2108,"VEILLARD","Quentin",2004,"G","BG2","F VILLON","PONTHIERRY"]
[2109,"GEA","Evan",2002,"G","MG","F VILLON","PONTHIERRY"]
[2110,"GIROULT","Yoann",2002,"G","MG","F VILLON","PONTHIERRY"]
[2111,null,null,null,null,"","F VILLON","PONTHIERRY"]
[2112,null,null,null,null,"","F VILLON","PONTHIERRY"]
[2113,null,null,null,null,{"$f":"IF(D2114=\"\",\"\",IF(E2114=\"f\",LOOKUP(D2114,cat_unss,cat_f),LOOKUP(D2114,cat_unss,cat_g)))","v":""},"F VILLON","PONTHIERRY"]
[2114,null,null,null,null,"","F VILLON","PONTHIERRY"]
[2115,null,null,null,null,"","F VILLON","PONTHIERRY"]
[2116,null,null,null,null,"","F VILLON","PONTHIERRY"]
[2117,null,null,null,null,"","F VILLON","PONTHIERRY"]
[2118,null,null,null,null,"","F VILLON","PONTHIERRY"]
[2119,null,null,null,null,"","F VILLON","PONTHIERRY"]
[2120,null,null,null,null,"","F VILLON","PONTHIERRY"]
[2121,null,null,null,null,"","F VILLON","PONTHIERRY"]
[2122,null,null,null,null,"","F VILLON","PONTHIERRY"]
[2123,null,null,null,null,"","F VILLON","PONTHIERRY"]
[2124,null,null,null,null,"","F VILLON","PONTHIERRY"]
[2125,null,null,null,null,"","F VILLON","PONTHIERRY"]
[2126,null,null,null,null,"","F VILLON","PONTHIERRY"]
[2127,null,null,null,null,"","F VILLON","PONTHIERRY"]
[2128,null,null,null,null,"","F VILLON","PONTHIERRY"]
[2129,null,null,null,null,"","F VILLON","PONTHIERRY"]
[2130,null,null,null,null,"","F VILLON","PONTHIERRY"]
[2131,null,null,null,null,"","F VILLON","PONTHIERRY"]
[2132,null,null,null,null,"","F VILLON","PONTHIERRY"]
[2133,null,null,null,null,"","F VILLON","PONTHIERRY"]
[2134,null,null,null,null,"","F VILLON","PONTHIERRY"]
[2135,null,null,null,null,"","F VILLON","PONTHIERRY"]
[2136,null,null,null,null,"","F VILLON","PONTHIERRY"]
[2137,null,null,null,null,"","F VILLON","PONTHIERRY"]
[2138,null,null,null,null,"","F VILLON","PONTHIERRY"]
[2139,null,null,null,null,"","F VILLON","PONTHIERRY"]
[2140,null,null,null,null,"","F VILLON","PONTHIERRY"]
[2141,null,null,null,null,"","F VILLON","PONTHIERRY"]
[2142,null,null,null,null,"","F VILLON","PONTHIERRY"]
[2143,null,null,null,null,"","F VILLON","PONTHIERRY"]
[2144,null,null,null,null,"","F VILLON","PONTHIERRY"]
[2145,null,null,null,null,"","F VILLON","PONTHIERRY"]
[2146,null,null,null,null,"","F VILLON","PONTHIERRY"]
[2147,null,null,null,null,"","F VILLON","PONTHIERRY"]
[2148,null,null,null,null,"","F VILLON","PONTHIERRY"]
[2149,null,null,null,null,"","F VILLON","PONTHIERRY"]
[2150,null,null,null,null,"","F VILLON","PONTHIERRY"]
[2151,null,null,null,null,"","F VILLON","PONTHIERRY"]
[2152,null,null,null,null,"","F VILLON","PONTHIERRY"]
[2153,null,null,null,null,"","F VILLON","PONTHIERRY"]
[2154,null,null,null,null,"","F VILLON","PONTHIERRY"]
[2155,null,null,null,null,"","F VILLON","PONTHIERRY"]
[2156,null,null,null,null,"","F VILLON","PONTHIERRY"]
[2157,null,null,null,null,"","F VILLON","PONTHIERRY"]
[2158,null,null,null,null,"","F VILLON","PONTHIERRY"]
[2159,null,null,null,null,"","F VILLON","PONTHIERRY"]
[2160,null,null,null,null,"","F VILLON","PONTHIERRY"]
[2161,null,null,null,null,"","F VILLON","PONTHIERRY"]
[2162,null,null,null,null,"","F VILLON","PONTHIERRY"]
[2163,null,null,null,null,"","F VILLON","PONTHIERRY"]
[2164,null,null,null,null,"","F VILLON","PONTHIERRY"]
[2165,null,null,null,null,"","F VILLON","PONTHIERRY"]
[2166,null,null,null,null,"","F VILLON","PONTHIERRY"]
[2167,null,null,null,null,"","F VILLON","PONTHIERRY"]
[2168,null,null,null,null,"","F VILLON","PONTHIERRY"]
[2169,null,null,null,null,"","F VILLON","PONTHIERRY"]
[2170,null,null,null,null,"","F VILLON","PONTHIERRY"]
[2171,null,null,null,null,"","F VILLON","PONTHIERRY"]
[2172,null,null,null,null,"","F VILLON","PONTHIERRY"]
[2173,null,null,null,null,"","F VILLON","PONTHIERRY"]
[2174,null,null,null,null,"","F VILLON","PONTHIERRY"]
[2175,null,null,null,null,"","F VILLON","PONTHIERRY"]
[2176,null,null,null,null,"","F VILLON","PONTHIERRY"]
[2177,null,null,null,null,{"$f":"IF(D2178=\"\",\"\",IF(E2178=\"f\",LOOKUP(D2178,cat_unss,cat_f),LOOKUP(D2178,cat_unss,cat_g)))","v":""},"F VILLON","PONTHIERRY"]
[2178,null,null,null,null,"","F VILLON","PONTHIERRY"]
[2179,null,null,null,null,"","F VILLON","PONTHIERRY"]
[2180,null,null,null,null,"","F VILLON","PONTHIERRY"]
[2181,null,null,null,null,"","F VILLON","PONTHIERRY"]
[2182,null,null,null,null,"","F VILLON","PONTHIERRY"]
[2183,null,null,null,null,"","F VILLON","PONTHIERRY"]
[2184,null,null,null,null,"","F VILLON","PONTHIERRY"]
[2185,null,null,null,null,"","F VILLON","PONTHIERRY"]
[2186,null,null,null,null,"","F VILLON","PONTHIERRY"]
[2187,null,null,null,null,"","F VILLON","PONTHIERRY"]
[2188,null,null,null,null,"","F VILLON","PONTHIERRY"]
[2189,null,null,null,null,"","F VILLON","PONTHIERRY"]
[2190,null,null,null,null,"","F VILLON","PONTHIERRY"]
[2191,null,null,null,null,"","F VILLON","PONTHIERRY"]
[2192,null,null,null,null,"","F VILLON","PONTHIERRY"]
[2193,null,null,null,null,"","F VILLON","PONTHIERRY"]
[2194,null,null,null,null,"","F VILLON","PONTHIERRY"]
[2195,null,null,null,null,"","F VILLON","PONTHIERRY"]
[2196,null,null,null,null,"","F VILLON","PONTHIERRY"]
[2197,null,null,null,null,"","F VILLON","PONTHIERRY"]
[2198,null,null,null,null,"","F VILLON","PONTHIERRY"]
[2199,null,null,null,null,"","F VILLON","PONTHIERRY"]
[2200,null,null,null,null,"","F VILLON","PONTHIERRY"]
[2201,null,null,null,null,"","F VILLON","PONTHIERRY"]
[2202,null,null,null,null,"","F VILLON","PONTHIERRY"]
[2203,null,null,null,null,"","F VILLON","PONTHIERRY"]
[2204,null,null,null,null,"","F VILLON","PONTHIERRY"]
[2205,null,null,null,null,"","F VILLON","PONTHIERRY"]
[2206,null,null,null,null,"","F VILLON","PONTHIERRY"]
[2207,null,null,null,null,"","F VILLON","PONTHIERRY"]
[2208,null,null,null,null,"","F VILLON","PONTHIERRY"]
[2209,null,null,null,null,"","F VILLON","PONTHIERRY"]
[2210,null,null,null,null,"","F VILLON","PONTHIERRY"]
[2211,null,null,null,null,"","F VILLON","PONTHIERRY"]
[2212,null,null,null,null,"","F VILLON","PONTHIERRY"]
[2213,null,null,null,null,"","F VILLON","PONTHIERRY"]
[2214,null,null,null,null,"","F VILLON","PONTHIERRY"]
[2215,null,null,null,null,"","F VILLON","PONTHIERRY"]
[2216,null,null,null,null,"","F VILLON","PONTHIERRY"]
[2217,null,null,null,null,"","F VILLON","PONTHIERRY"]
[2218,null,null,null,null,"","F VILLON","PONTHIERRY"]
[2219,null,null,null,null,"","F VILLON","PONTHIERRY"]
[2220,null,null,null,null,"","F VILLON","PONTHIERRY"]
[2221,null,null,null,null,"","F VILLON","PONTHIERRY"]
[2222,null,null,null,null,"","F VILLON","PONTHIERRY"]
[2223,null,null,null,null,"","F VILLON","PONTHIERRY"]
[2224,null,null,null,null,"","F VILLON","PONTHIERRY"]
[2225,null,null,null,null,"","F VILLON","PONTHIERRY"]
[2226,null,null,null,null,"","F VILLON","PONTHIERRY"]
[2227,null,null,null,null,"","F VILLON","PONTHIERRY"]
[2228,null,null,null,null,"","F VILLON","PONTHIERRY"]
[2229,null,null,null,null,"","F VILLON","PONTHIERRY"]
[2230,null,null,null,null,"","F VILLON","PONTHIERRY"]
[2231,null,null,null,null,"","F VILLON","PONTHIERRY"]
[2232,null,null,null,null,"","F VILLON","PONTHIERRY"]
[2233,null,null,null,null,"","F VILLON","PONTHIERRY"]
[2234,null,null,null,null,"","F VILLON","PONTHIERRY"]
[2235,null,null,null,null,"","F VILLON","PONTHIERRY"]
[2236,null,null,null,null,"","F VILLON","PONTHIERRY"]
[2237,null,null,null,null,"","F VILLON","PONTHIERRY"]
[2238,null,null,null,null,"","F VILLON","PONTHIERRY"]
[2239,null,null,null,null,"","F VILLON","PONTHIERRY"]
[2240,null,null,null,null,"","F VILLON","PONTHIERRY"]
[2241,null,null,null,null,{"$f":"IF(D2242=\"\",\"\",IF(E2242=\"f\",LOOKUP(D2242,cat_unss,cat_f),LOOKUP(D2242,cat_unss,cat_g)))","v":""},"F VILLON","PONTHIERRY"]
[2242,null,null,null,null,"","F VILLON","PONTHIERRY"]
[2243,null,null,null,null,"","F VILLON","PONTHIERRY"]
[2244,null,null,null,null,"","F VILLON","PONTHIERRY"]
[2245,null,null,null,null,"","F VILLON","PONTHIERRY"]
[2246,null,null,null,null,"","F VILLON","PONTHIERRY"]
[2247,null,null,null,null,"","F VILLON","PONTHIERRY"]
[2248,null,null,null,null,"","F VILLON","PONTHIERRY"]
[2249,null,null,null,null,"","F VILLON","PONTHIERRY"]
[2250,null,null,null,null,"","F VILLON","PONTHIERRY"]
[2251,null,null,null,null,"","F VILLON","PONTHIERRY"]
[2252,null,null,null,null,"","F VILLON","PONTHIERRY"]
[2253,null,null,null,null,"","F VILLON","PONTHIERRY"]
[2254,null,null,null,null,"","F VILLON","PONTHIERRY"]
[2255,null,null,null,null,"","F VILLON","PONTHIERRY"]
[2256,null,null,null,null,"","F VILLON","PONTHIERRY"]
[2257,null,null,null,null,"","F VILLON","PONTHIERRY"]
[2258,null,null,null,null,"","F VILLON","PONTHIERRY"]
[2259,null,null,null,null,"","F VILLON","PONTHIERRY"]
[2260,null,null,null,null,"","F VILLON","PONTHIERRY"]
[2261,null,null,null,null,"","F VILLON","PONTHIERRY"]
[2262,null,null,null,null,"","F VILLON","PONTHIERRY"]
[2263,null,null,null,null,"","F VILLON","PONTHIERRY"]
[2264,null,null,null,null,"","F VILLON","PONTHIERRY"]
[2265,null,null,null,null,"","F VILLON","PONTHIERRY"]
[2266,null,null,null,null,"","F VILLON","PONTHIERRY"]
[2267,null,null,null,null,"","F VILLON","PONTHIERRY"]
[2268,null,null,null,null,"","F VILLON","PONTHIERRY"]
[2269,null,null,null,null,"","F VILLON","PONTHIERRY"]
[2270,null,null,null,null,"","F VILLON","PONTHIERRY"]
[2271,null,null,null,null,"","F VILLON","PONTHIERRY"]
[2272,null,null,null,null,"","F VILLON","PONTHIERRY"]
[2273,null,null,null,null,"","F VILLON","PONTHIERRY"]
[2274,null,null,null,null,"","F VILLON","PONTHIERRY"]
[2275,null,null,null,null,"","F VILLON","PONTHIERRY"]
[2276,null,null,null,null,"","F VILLON","PONTHIERRY"]
[2277,null,null,null,null,"","F VILLON","PONTHIERRY"]
[2278,null,null,null,null,"","F VILLON","PONTHIERRY"]
[2279,null,null,null,null,"","F VILLON","PONTHIERRY"]
[2280,null,null,null,null,"","F VILLON","PONTHIERRY"]
[2281,null,null,null,null,"","F VILLON","PONTHIERRY"]
[2282,null,null,null,null,"","F VILLON","PONTHIERRY"]
[2283,null,null,null,null,"","F VILLON","PONTHIERRY"]
[2284,null,null,null,null,"","F VILLON","PONTHIERRY"]
[2285,null,null,null,null,"","F VILLON","PONTHIERRY"]
[2286,null,null,null,null,"","F VILLON","PONTHIERRY"]
[2287,null,null,null,null,"","F VILLON","PONTHIERRY"]
[2288,null,null,null,null,"","F VILLON","PONTHIERRY"]
[2289,null,null,null,null,"","F VILLON","PONTHIERRY"]
[2290,null,null,null,null,"","F VILLON","PONTHIERRY"]
[2291,null,null,null,null,"","F VILLON","PONTHIERRY"]
[2292,null,null,null,null,"","F VILLON","PONTHIERRY"]
[2293,null,null,null,null,"","F VILLON","PONTHIERRY"]
[2294,null,null,null,null,"","F VILLON","PONTHIERRY"]
[2295,null,null,null,null,"","F VILLON","PONTHIERRY"]
[2296,null,null,null,null,"","F VILLON","PONTHIERRY"]
[2297,null,null,null,null,"","F VILLON","PONTHIERRY"]
[2298,null,null,null,null,"","F VILLON","PONTHIERRY"]
[2299,null,null,null,null,"","F VILLON","PONTHIERRY"]
[2300,null,null,null,null,"","F VILLON","PONTHIERRY"]
[2301,null,null,null,null,"","F VILLON","PONTHIERRY"]
[2302,null,null,null,null,"","F VILLON","PONTHIERRY"]
[2303,null,null,null,null,"","F VILLON","PONTHIERRY"]
[2304,null,null,null,null,"","F VILLON","PONTHIERRY"]
[2305,null,null,null,null,{"$f":"IF(D2306=\"\",\"\",IF(E2306=\"f\",LOOKUP(D2306,cat_unss,cat_f),LOOKUP(D2306,cat_unss,cat_g)))","v":""},"F VILLON","PONTHIERRY"]
[2306,null,null,null,null,"","F VILLON","PONTHIERRY"]
[2307,null,null,null,null,"","F VILLON","PONTHIERRY"]
[2308,null,null,null,null,"","F VILLON","PONTHIERRY"]
[2309,null,null,null,null,"","F VILLON","PONTHIERRY"]
[2310,null,null,null,null,"","F VILLON","PONTHIERRY"]
[2311,null,null,null,null,"","F VILLON","PONTHIERRY"]
[2312,null,null,null,null,"","F VILLON","PONTHIERRY"]
[2313,null,null,null,null,"","F VILLON","PONTHIERRY"]
[2314,null,null,null,null,"","F VILLON","PONTHIERRY"]
[2315,null,null,null,null,"","F VILLON","PONTHIERRY"]
[2316,null,null,null,null,"","F VILLON","PONTHIERRY"]
[2317,null,null,null,null,"","F VILLON","PONTHIERRY"]
[2318,null,null,null,null,"","F VILLON","PONTHIERRY"]
[2319,null,null,null,null,"","F VILLON","PONTHIERRY"]
[2320,null,null,null,null,"","F VILLON","PONTHIERRY"]
[2321,null,null,null,null,"","F VILLON","PONTHIERRY"]
[2322,null,null,null,null,"","F VILLON","PONTHIERRY"]
[2323,null,null,null,null,"","F VILLON","PONTHIERRY"]
[2324,null,null,null,null,"","F VILLON","PONTHIERRY"]
[2325,null,null,null,null,"","F VILLON","PONTHIERRY"]
[2326,null,null,null,null,"","F VILLON","PONTHIERRY"]
[2327,null,null,null,null,"","F VILLON","PONTHIERRY"]
[2328,null,null,null,null,"","F VILLON","PONTHIERRY"]
[2329,null,null,null,null,"","F VILLON","PONTHIERRY"]
[2330,null,null,null,null,"","F VILLON","PONTHIERRY"]
[2331,null,null,null,null,"","F VILLON","PONTHIERRY"]
[2332,null,null,null,null,"","F VILLON","PONTHIERRY"]
[2333,null,null,null,null,"","F VILLON","PONTHIERRY"]
[2334,null,null,null,null,"","F VILLON","PONTHIERRY"]
[2335,null,null,null,null,"","F VILLON","PONTHIERRY"]
[2336,null,null,null,null,"","F VILLON","PONTHIERRY"]
[2337,null,null,null,null,"","F VILLON","PONTHIERRY"]
[2338,null,null,null,null,"","F VILLON","PONTHIERRY"]
[2339,null,null,null,null,"","F VILLON","PONTHIERRY"]
[2340,null,null,null,null,"","F VILLON","PONTHIERRY"]
[2341,null,null,null,null,"","F VILLON","PONTHIERRY"]
[2342,null,null,null,null,"","F VILLON","PONTHIERRY"]
[2343,null,null,null,null,"","F VILLON","PONTHIERRY"]
[2344,null,null,null,null,"","F VILLON","PONTHIERRY"]
[2345,null,null,null,null,"","F VILLON","PONTHIERRY"]
[2346,null,null,null,null,"","F VILLON","PONTHIERRY"]
[2347,null,null,null,null,"","F VILLON","PONTHIERRY"]
[2348,null,null,null,null,"","F VILLON","PONTHIERRY"]
[2349,null,null,null,null,"","F VILLON","PONTHIERRY"]
[2350,null,null,null,null,"","F VILLON","PONTHIERRY"]
[2351,null,null,null,null,"","F VILLON","PONTHIERRY"]
[2352,null,null,null,null,"","F VILLON","PONTHIERRY"]
[2353,null,null,null,null,"","F VILLON","PONTHIERRY"]
[2354,null,null,null,null,"","F VILLON","PONTHIERRY"]
[2355,null,null,null,null,"","F VILLON","PONTHIERRY"]
[2356,null,null,null,null,"","F VILLON","PONTHIERRY"]
[2357,null,null,null,null,"","F VILLON","PONTHIERRY"]
[2358,null,null,null,null,"","F VILLON","PONTHIERRY"]
[2359,null,null,null,null,"","F VILLON","PONTHIERRY"]
[2360,null,null,null,null,"","F VILLON","PONTHIERRY"]
[2361,null,null,null,null,"","F VILLON","PONTHIERRY"]
[2362,null,null,null,null,"","F VILLON","PONTHIERRY"]
[2363,null,null,null,null,"","F VILLON","PONTHIERRY"]
[2364,null,null,null,null,"","F VILLON","PONTHIERRY"]
[2365,null,null,null,null,"","F VILLON","PONTHIERRY"]
[2366,null,null,null,null,"","F VILLON","PONTHIERRY"]
[2367,null,null,null,null,"","F VILLON","PONTHIERRY"]
[2368,null,null,null,null,"","F VILLON","PONTHIERRY"]
[2369,null,null,null,null,{"$f":"IF(D2370=\"\",\"\",IF(E2370=\"f\",LOOKUP(D2370,cat_unss,cat_f),LOOKUP(D2370,cat_unss,cat_g)))","v":""},"F VILLON","PONTHIERRY"]
[2370,null,null,null,null,"","F VILLON","PONTHIERRY"]
[2371,null,null,null,null,"","F VILLON","PONTHIERRY"]
[2372,null,null,null,null,"","F VILLON","PONTHIERRY"]
[2373,null,null,null,null,"","F VILLON","PONTHIERRY"]
[2374,null,null,null,null,"","F VILLON","PONTHIERRY"]
[2375,null,null,null,null,"","F VILLON","PONTHIERRY"]
[2376,null,null,null,null,"","F VILLON","PONTHIERRY"]
[2377,null,null,null,null,"","F VILLON","PONTHIERRY"]
[2378,null,null,null,null,"","F VILLON","PONTHIERRY"]
[2379,null,null,null,null,"","F VILLON","PONTHIERRY"]
[2380,null,null,null,null,"","F VILLON","PONTHIERRY"]
[2381,null,null,null,null,"","F VILLON","PONTHIERRY"]
[2382,null,null,null,null,"","F VILLON","PONTHIERRY"]
[2383,null,null,null,null,"","F VILLON","PONTHIERRY"]
[2384,null,null,null,null,"","F VILLON","PONTHIERRY"]
[2385,null,null,null,null,"","F VILLON","PONTHIERRY"]
[2386,null,null,null,null,"","F VILLON","PONTHIERRY"]
[2387,null,null,null,null,"","F VILLON","PONTHIERRY"]
[2388,null,null,null,null,"","F VILLON","PONTHIERRY"]
[2389,null,null,null,null,"","F VILLON","PONTHIERRY"]
[2390,null,null,null,null,"","F VILLON","PONTHIERRY"]
[2391,null,null,null,null,"","F VILLON","PONTHIERRY"]
[2392,null,null,null,null,"","F VILLON","PONTHIERRY"]
[2393,null,null,null,null,"","F VILLON","PONTHIERRY"]
[2394,null,null,null,null,"","F VILLON","PONTHIERRY"]
[2395,null,null,null,null,"","F VILLON","PONTHIERRY"]
[2396,null,null,null,null,"","F VILLON","PONTHIERRY"]
[2397,null,null,null,null,"","F VILLON","PONTHIERRY"]
[2398,null,null,null,null,"","F VILLON","PONTHIERRY"]
[2399,null,null,null,null,"","F VILLON","PONTHIERRY"]
[2400,null,null,null,null,"","F VILLON","PONTHIERRY"]
[2401,"VIGNAL","Margot",2002,"F","MF","J AMYOT","MELUN"]
[2402,"KAZONGA","Jenilia",2002,"F","MF","J AMYOT","MELUN"]
[2403,"SAWA","Ludivine",2002,"F","MF","J AMYOT","MELUN"]
[2404,"INSINSKI","Mathilde",2003,"F","MF","J AMYOT","MELUN"]
[2405,"MADIABOLA","Megane",2002,"F","MF","J AMYOT","MELUN"]
[2406,"MAKUAKASA","Eva",2002,"F","MF","J AMYOT","MELUN"]
[2407,"AGUEJGUAL","Zineb",2003,"F","MF","J AMYOT","MELUN"]
[2408,"CUSSY","Eva",2003,"F","MF","J AMYOT","MELUN"]
[2409,"MOREIRA","Julie",2003,"F","MF","J AMYOT","MELUN"]
[2410,"MAROUTEAU","Manon",2002,"F","MF","J AMYOT","MELUN"]
[2411,"LABIDI","Maelle",2003,"F","MF","J AMYOT","MELUN"]
[2412,"MUKUNGU","Chloe",2003,"F","MF","J AMYOT","MELUN"]
[2413,"CUSINATO","Kenzo",2002,"M","MG","J AMYOT","MELUN"]
[2414,"LANDEL","Arthur",2001,"M","CG","J AMYOT","MELUN"]
[2415,"AVENEL","Kerian",2002,"M","MG","J AMYOT","MELUN"]
[2416,"AVENEL","Eyrian",2002,"M","MG","J AMYOT","MELUN"]
[2417,"HUBERT","Flavien",2002,"M","MG","J AMYOT","MELUN"]
[2418,"KOULTCHENKO","Iwan",2003,"M","MG","J AMYOT","MELUN"]
[2419,"DEOLIVEIRA","Anthony",2002,"M","MG","J AMYOT","MELUN"]
[2420,"BITOUMBOU","Jean remy",2002,"M","MG","J AMYOT","MELUN"]
[2421,"BITOUMBOU","Jean luc",2002,"M","MG","J AMYOT","MELUN"]
[2422,"AKBAY","Yusuf",2002,"M","MG","J AMYOT","MELUN"]
[2423,"BELKAHLA","Faissal",2002,"M","MG","J AMYOT","MELUN"]
[2424,"NETTE","Alexandre",2003,"M","MG","J AMYOT","MELUN"]
[2425,"BRAYER","Matteo",2003,"M","MG","J AMYOT","MELUN"]
[2426,"CHAUSSE","Adrian",2004,"M","BG2","J AMYOT","MELUN"]
[2427,"DJIMADOUM","Eliot",2004,"M","BG2","J AMYOT","MELUN"]
[2428,"RASOLO","Riantsoa",2005,"M","BG1","J AMYOT","MELUN"]
[2429,"COUPPE DE KER MARTIN","Matteo",2004,"M","BG2","J AMYOT","MELUN"]
[2430,"DIABY","Ibrahima",2004,"M","BG2","J AMYOT","MELUN"]
[2431,"CALMEL","Simon",2004,"M","BG2","J AMYOT","MELUN"]
[2432,"LEGHIMA","Mouhammad",2004,"M","BG2","J AMYOT","MELUN"]
[2433,"MARTINEZ","Igor",2004,"M",{"$f":"IF(D2434=\"\",\"\",IF(E2434=\"f\",LOOKUP(D2434,cat_unss,cat_f),LOOKUP(D2434,cat_unss,cat_g)))","v":"BG2"},"J AMYOT","MELUN"]
[2434,"MAKHLOUF","Mohamed",2004,"M","BG2","J AMYOT","MELUN"]
[2435,"VIGNAL","Jeanne",2004,"F","BF2","J AMYOT","MELUN"]
[2436,"MADRID","Amelie",2004,"F","BF2","J AMYOT","MELUN"]
[2437,"AISSAOUI","Amel",2004,"F","BF2","J AMYOT","MELUN"]
[2438,"DAS SANTOS","Marylou",2004,"F","BF2","J AMYOT","MELUN"]
[2439,"BONNET","Lia",2004,"F","BF2","J AMYOT","MELUN"]
[2440,"CIARAVOLA","Juliette",2004,"F","BF2","J AMYOT","MELUN"]
[2441,"SAHNOUN","Nabila",2004,"F","BF2","J AMYOT","MELUN"]
[2442,"CHRISTOPHER","Lorene",2004,"F","BF2","J AMYOT","MELUN"]
[2443,"MUZINGA","Julia",2004,"F","BF2","J AMYOT","MELUN"]
[2444,"VIGUIER","Constance",2004,"F","BF2","J AMYOT","MELUN"]
[2445,"LECOMTE","Lucas",2004,"M","BG2","J AMYOT","MELUN"]
[2446,"PETIT","Emilie",2005,"F","BF1","J AMYOT","MELUN"]
[2447,"MOUDACHE","Maissa",2005,"F","BF1","J AMYOT","MELUN"]
[2448,"MUNKETTE","Joyce",2005,"F","BF1","J AMYOT","MELUN"]
[2449,"COUSIN","Emmeline",2006,"F","BF1","J AMYOT","MELUN"]
[2450,"CHAILLOT","Ema",2005,"F","BF1","J AMYOT","MELUN"]
[2451,"FAURE","Karla",2005,"F","BF1","J AMYOT","MELUN"]
[2452,"IWANI","Laetitia",2004,"F","BF2","J AMYOT","MELUN"]
[2453,"ROUAND","Tiffany",2005,"F","BF1","J AMYOT","MELUN"]
[2454,"GAGE","Cassandra",2005,"F","BF1","J AMYOT","MELUN"]
[2455,"LAGARDE","Adèle",2005,"F","BF1","J AMYOT","MELUN"]
[2456,"PAWLIK","Benoit",2005,"M","BG1","J AMYOT","MELUN"]
[2457,"ROGER","Noa",2005,"M","BG1","J AMYOT","MELUN"]
[2458,"AKHMADOU","Mouhammad",2005,"M","BG1","J AMYOT","MELUN"]
[2459,"LEGHIMA","Yasin",2005,"M","BG1","J AMYOT","MELUN"]
[2460,"LAMOUR","Rayan",2005,"M","BG1","J AMYOT","MELUN"]
[2461,"PROTIN","Lucas",2004,"M","BG2","J AMYOT","MELUN"]
[2462,"CLEMENT LAMBERT","Antonin",2005,"M","BG1","J AMYOT","MELUN"]
[2463,"BRIDJA","Abed",2005,"M","BG1","J AMYOT","MELUN"]
[2464,"FAHIM","Sofiane",2005,"M","BG1","J AMYOT","MELUN"]
[2465,"AISSAOUI","Marwane",2005,"M","BG1","J AMYOT","MELUN"]
[2466,"HAINAUT","Maxime",2002,"M","MG","J AMYOT","MELUN"]
[2467,"DRICI","MOUNIR",2005,"M","BG1","J AMYOT","MELUN"]
[2468,"ZEKER","EZGI",2002,"F","MF","J AMYOT","MELUN"]
[2469,"HOUELLE","FLORIANE",2002,"F","MF","J AMYOT","MELUN"]
[2470,"PAWLIK","REMY",2002,null,"MG","J AMYOT","MELUN"]
[2471,null,null,null,null,"","J AMYOT","MELUN"]
[2472,null,null,null,null,"","J AMYOT","MELUN"]
[2473,null,null,null,null,"","J AMYOT","MELUN"]
[2474,null,null,null,null,"","J AMYOT","MELUN"]
[2475,null,null,null,null,"","J AMYOT","MELUN"]
[2476,null,null,null,null,"","J AMYOT","MELUN"]
[2477,null,null,null,null,"","J AMYOT","MELUN"]
[2478,null,null,null,null,"","J AMYOT","MELUN"]
[2479,null,null,null,null,"","J AMYOT","MELUN"]
[2480,null,null,null,null,"","J AMYOT","MELUN"]
[2481,null,null,null,null,"","J AMYOT","MELUN"]
[2482,null,null,null,null,"","J AMYOT","MELUN"]
[2483,null,null,null,null,"","J AMYOT","MELUN"]
[2484,null,null,null,null,"","J AMYOT","MELUN"]
[2485,null,null,null,null,"","J AMYOT","MELUN"]
[2486,null,null,null,null,"","J AMYOT","MELUN"]
[2487,null,null,null,null,"","J AMYOT","MELUN"]
[2488,null,null,null,null,"","J AMYOT","MELUN"]
[2489,null,null,null,null,"","J AMYOT","MELUN"]
[2490,null,null,null,null,"","J AMYOT","MELUN"]
[2491,null,null,null,null,"","J AMYOT","MELUN"]
[2492,null,null,null,null,"","J AMYOT","MELUN"]
[2493,null,null,null,null,"","J AMYOT","MELUN"]
[2494,null,null,null,null,"","J AMYOT","MELUN"]
[2495,null,null,null,null,"","J AMYOT","MELUN"]
[2496,null,null,null,null,"","J AMYOT","MELUN"]
[2497,null,null,null,null,{"$f":"IF(D2498=\"\",\"\",IF(E2498=\"f\",LOOKUP(D2498,cat_unss,cat_f),LOOKUP(D2498,cat_unss,cat_g)))","v":""},"J AMYOT","MELUN"]
[2498,null,null,null,null,"","J AMYOT","MELUN"]
[2499,null,null,null,null,"","J AMYOT","MELUN"]
[2500,null,null,null,null,"","J AMYOT","MELUN"]
[2501,null,null,null,null,"","J AMYOT","MELUN"]
[2502,null,null,null,null,"","J AMYOT","MELUN"]
[2503,null,null,null,null,"","J AMYOT","MELUN"]
[2504,null,null,null,null,"","J AMYOT","MELUN"]
[2505,null,null,null,null,"","J AMYOT","MELUN"]
[2506,null,null,null,null,"","J AMYOT","MELUN"]
[2507,null,null,null,null,"","J AMYOT","MELUN"]
[2508,null,null,null,null,"","J AMYOT","MELUN"]
[2509,null,null,null,null,"","J AMYOT","MELUN"]
[2510,null,null,null,null,"","J AMYOT","MELUN"]
[2511,null,null,null,null,"","J AMYOT","MELUN"]
[2512,null,null,null,null,"","J AMYOT","MELUN"]
[2513,null,null,null,null,"","J AMYOT","MELUN"]
[2514,null,null,null,null,"","J AMYOT","MELUN"]
[2515,null,null,null,null,"","J AMYOT","MELUN"]
[2516,null,null,null,null,"","J AMYOT","MELUN"]
[2517,null,null,null,null,"","J AMYOT","MELUN"]
[2518,null,null,null,null,"","J AMYOT","MELUN"]
[2519,null,null,null,null,"","J AMYOT","MELUN"]
[2520,null,null,null,null,"","J AMYOT","MELUN"]
[2521,null,null,null,null,"","J AMYOT","MELUN"]
[2522,null,null,null,null,"","J AMYOT","MELUN"]
[2523,null,null,null,null,"","J AMYOT","MELUN"]
[2524,null,null,null,null,"","J AMYOT","MELUN"]
[2525,null,null,null,null,"","J AMYOT","MELUN"]
[2526,null,null,null,null,"","J AMYOT","MELUN"]
[2527,null,null,null,null,"","J AMYOT","MELUN"]
[2528,null,null,null,null,"","J AMYOT","MELUN"]
[2529,null,null,null,null,"","J AMYOT","MELUN"]
[2530,null,null,null,null,"","J AMYOT","MELUN"]
[2531,null,null,null,null,"","J AMYOT","MELUN"]
[2532,null,null,null,null,"","J AMYOT","MELUN"]
[2533,null,null,null,null,"","J AMYOT","MELUN"]
[2534,null,null,null,null,"","J AMYOT","MELUN"]
[2535,null,null,null,null,"","J AMYOT","MELUN"]
[2536,null,null,null,null,"","J AMYOT","MELUN"]
[2537,null,null,null,null,"","J AMYOT","MELUN"]
[2538,null,null,null,null,"","J AMYOT","MELUN"]
[2539,null,null,null,null,"","J AMYOT","MELUN"]
[2540,null,null,null,null,"","J AMYOT","MELUN"]
[2541,null,null,null,null,"","J AMYOT","MELUN"]
[2542,null,null,null,null,"","J AMYOT","MELUN"]
[2543,null,null,null,null,"","J AMYOT","MELUN"]
[2544,null,null,null,null,"","J AMYOT","MELUN"]
[2545,null,null,null,null,"","J AMYOT","MELUN"]
[2546,null,null,null,null,"","J AMYOT","MELUN"]
[2547,null,null,null,null,"","J AMYOT","MELUN"]
[2548,null,null,null,null,"","J AMYOT","MELUN"]
[2549,null,null,null,null,"","J AMYOT","MELUN"]
[2550,null,null,null,null,"","J AMYOT","MELUN"]
[2551,null,null,null,null,"","J AMYOT","MELUN"]
[2552,null,null,null,null,"","J AMYOT","MELUN"]
[2553,null,null,null,null,"","J AMYOT","MELUN"]
[2554,null,null,null,null,"","J AMYOT","MELUN"]
[2555,null,null,null,null,"","J AMYOT","MELUN"]
[2556,null,null,null,null,"","J AMYOT","MELUN"]
[2557,null,null,null,null,"","J AMYOT","MELUN"]
[2558,null,null,null,null,"","J AMYOT","MELUN"]
[2559,null,null,null,null,"","J AMYOT","MELUN"]
[2560,null,null,null,null,"","J AMYOT","MELUN"]
[2561,null,null,null,null,{"$f":"IF(D2562=\"\",\"\",IF(E2562=\"f\",LOOKUP(D2562,cat_unss,cat_f),LOOKUP(D2562,cat_unss,cat_g)))","v":""},"J AMYOT","MELUN"]
[2562,null,null,null,null,"","J AMYOT","MELUN"]
[2563,null,null,null,null,"","J AMYOT","MELUN"]
[2564,null,null,null,null,"","J AMYOT","MELUN"]
[2565,null,null,null,null,"","J AMYOT","MELUN"]
[2566,null,null,null,null,"","J AMYOT","MELUN"]
[2567,null,null,null,null,"","J AMYOT","MELUN"]
[2568,null,null,null,null,"","J AMYOT","MELUN"]
[2569,null,null,null,null,"","J AMYOT","MELUN"]
[2570,null,null,null,null,"","J AMYOT","MELUN"]
[2571,null,null,null,null,"","J AMYOT","MELUN"]
[2572,null,null,null,null,"","J AMYOT","MELUN"]
[2573,null,null,null,null,"","J AMYOT","MELUN"]
[2574,null,null,null,null,"","J AMYOT","MELUN"]
[2575,null,null,null,null,"","J AMYOT","MELUN"]
[2576,null,null,null,null,"","J AMYOT","MELUN"]
[2577,null,null,null,null,"","J AMYOT","MELUN"]
[2578,null,null,null,null,"","J AMYOT","MELUN"]
[2579,null,null,null,null,"","J AMYOT","MELUN"]
[2580,null,null,null,null,"","J AMYOT","MELUN"]
[2581,null,null,null,null,"","J AMYOT","MELUN"]
[2582,null,null,null,null,"","J AMYOT","MELUN"]
[2583,null,null,null,null,"","J AMYOT","MELUN"]
[2584,null,null,null,null,"","J AMYOT","MELUN"]
[2585,null,null,null,null,"","J AMYOT","MELUN"]
[2586,null,null,null,null,"","J AMYOT","MELUN"]
[2587,null,null,null,null,"","J AMYOT","MELUN"]
[2588,null,null,null,null,"","J AMYOT","MELUN"]
[2589,null,null,null,null,"","J AMYOT","MELUN"]
[2590,null,null,null,null,"","J AMYOT","MELUN"]
[2591,null,null,null,null,"","J AMYOT","MELUN"]
[2592,null,null,null,null,"","J AMYOT","MELUN"]
[2593,null,null,null,null,"","J AMYOT","MELUN"]
[2594,null,null,null,null,"","J AMYOT","MELUN"]
[2595,null,null,null,null,"","J AMYOT","MELUN"]
[2596,null,null,null,null,"","J AMYOT","MELUN"]
[2597,null,null,null,null,"","J AMYOT","MELUN"]
[2598,null,null,null,null,"","J AMYOT","MELUN"]
[2599,null,null,null,null,"","J AMYOT","MELUN"]
[2600,null,null,null,null,"","J AMYOT","MELUN"]
[2601,null,null,null,null,"","J AMYOT","MELUN"]
[2602,null,null,null,null,"","J AMYOT","MELUN"]
[2603,null,null,null,null,"","J AMYOT","MELUN"]
[2604,null,null,null,null,"","J AMYOT","MELUN"]
[2605,null,null,null,null,"","J AMYOT","MELUN"]
[2606,null,null,null,null,"","J AMYOT","MELUN"]
[2607,null,null,null,null,"","J AMYOT","MELUN"]
[2608,null,null,null,null,"","J AMYOT","MELUN"]
[2609,null,null,null,null,"","J AMYOT","MELUN"]
[2610,null,null,null,null,"","J AMYOT","MELUN"]
[2611,null,null,null,null,"","J AMYOT","MELUN"]
[2612,null,null,null,null,"","J AMYOT","MELUN"]
[2613,null,null,null,null,"","J AMYOT","MELUN"]
[2614,null,null,null,null,"","J AMYOT","MELUN"]
[2615,null,null,null,null,"","J AMYOT","MELUN"]
[2616,null,null,null,null,"","J AMYOT","MELUN"]
[2617,null,null,null,null,"","J AMYOT","MELUN"]
[2618,null,null,null,null,"","J AMYOT","MELUN"]
[2619,null,null,null,null,"","J AMYOT","MELUN"]
[2620,null,null,null,null,"","J AMYOT","MELUN"]
[2621,null,null,null,null,"","J AMYOT","MELUN"]
[2622,null,null,null,null,"","J AMYOT","MELUN"]
[2623,null,null,null,null,"","J AMYOT","MELUN"]
[2624,null,null,null,null,"","J AMYOT","MELUN"]
[2625,null,null,null,null,{"$f":"IF(D2626=\"\",\"\",IF(E2626=\"f\",LOOKUP(D2626,cat_unss,cat_f),LOOKUP(D2626,cat_unss,cat_g)))","v":""},"J AMYOT","MELUN"]
[2626,null,null,null,null,"","J AMYOT","MELUN"]
[2627,null,null,null,null,"","J AMYOT","MELUN"]
[2628,null,null,null,null,"","J AMYOT","MELUN"]
[2629,null,null,null,null,"","J AMYOT","MELUN"]
[2630,null,null,null,null,"","J AMYOT","MELUN"]
[2631,null,null,null,null,"","J AMYOT","MELUN"]
[2632,null,null,null,null,"","J AMYOT","MELUN"]
[2633,null,null,null,null,"","J AMYOT","MELUN"]
[2634,null,null,null,null,"","J AMYOT","MELUN"]
[2635,null,null,null,null,"","J AMYOT","MELUN"]
[2636,null,null,null,null,"","J AMYOT","MELUN"]
[2637,null,null,null,null,"","J AMYOT","MELUN"]
[2638,null,null,null,null,"","J AMYOT","MELUN"]
[2639,null,null,null,null,"","J AMYOT","MELUN"]
[2640,null,null,null,null,"","J AMYOT","MELUN"]
[2641,null,null,null,null,"","J AMYOT","MELUN"]
[2642,null,null,null,null,"","J AMYOT","MELUN"]
[2643,null,null,null,null,"","J AMYOT","MELUN"]
[2644,null,null,null,null,"","J AMYOT","MELUN"]
[2645,null,null,null,null,"","J AMYOT","MELUN"]
[2646,null,null,null,null,"","J AMYOT","MELUN"]
[2647,null,null,null,null,"","J AMYOT","MELUN"]
[2648,null,null,null,null,"","J AMYOT","MELUN"]
[2649,null,null,null,null,"","J AMYOT","MELUN"]
[2650,null,null,null,null,"","J AMYOT","MELUN"]
[2651,null,null,null,null,"","J AMYOT","MELUN"]
[2652,null,null,null,null,"","J AMYOT","MELUN"]
[2653,null,null,null,null,"","J AMYOT","MELUN"]
[2654,null,null,null,null,"","J AMYOT","MELUN"]
[2655,null,null,null,null,"","J AMYOT","MELUN"]
[2656,null,null,null,null,"","J AMYOT","MELUN"]
[2657,null,null,null,null,"","J AMYOT","MELUN"]
[2658,null,null,null,null,"","J AMYOT","MELUN"]
[2659,null,null,null,null,"","J AMYOT","MELUN"]
[2660,null,null,null,null,"","J AMYOT","MELUN"]
[2661,null,null,null,null,"","J AMYOT","MELUN"]
[2662,null,null,null,null,"","J AMYOT","MELUN"]
[2663,null,null,null,null,"","J AMYOT","MELUN"]
[2664,null,null,null,null,"","J AMYOT","MELUN"]
[2665,null,null,null,null,"","J AMYOT","MELUN"]
[2666,null,null,null,null,"","J AMYOT","MELUN"]
[2667,null,null,null,null,"","J AMYOT","MELUN"]
[2668,null,null,null,null,"","J AMYOT","MELUN"]
[2669,null,null,null,null,"","J AMYOT","MELUN"]
[2670,null,null,null,null,"","J AMYOT","MELUN"]
[2671,null,null,null,null,"","J AMYOT","MELUN"]
[2672,null,null,null,null,"","J AMYOT","MELUN"]
[2673,null,null,null,null,"","J AMYOT","MELUN"]
[2674,null,null,null,null,"","J AMYOT","MELUN"]
[2675,null,null,null,null,"","J AMYOT","MELUN"]
[2676,null,null,null,null,"","J AMYOT","MELUN"]
[2677,null,null,null,null,"","J AMYOT","MELUN"]
[2678,null,null,null,null,"","J AMYOT","MELUN"]
[2679,null,null,null,null,"","J AMYOT","MELUN"]
[2680,null,null,null,null,"","J AMYOT","MELUN"]
[2681,null,null,null,null,"","J AMYOT","MELUN"]
[2682,null,null,null,null,"","J AMYOT","MELUN"]
[2683,null,null,null,null,"","J AMYOT","MELUN"]
[2684,null,null,null,null,"","J AMYOT","MELUN"]
[2685,null,null,null,null,"","J AMYOT","MELUN"]
[2686,null,null,null,null,"","J AMYOT","MELUN"]
[2687,null,null,null,null,"","J AMYOT","MELUN"]
[2688,null,null,null,null,"","J AMYOT","MELUN"]
[2689,null,null,null,null,{"$f":"IF(D2690=\"\",\"\",IF(E2690=\"f\",LOOKUP(D2690,cat_unss,cat_f),LOOKUP(D2690,cat_unss,cat_g)))","v":""},"J AMYOT","MELUN"]
[2690,null,null,null,null,"","J AMYOT","MELUN"]
[2691,null,null,null,null,"","J AMYOT","MELUN"]
[2692,null,null,null,null,"","J AMYOT","MELUN"]
[2693,null,null,null,null,"","J AMYOT","MELUN"]
[2694,null,null,null,null,"","J AMYOT","MELUN"]
[2695,null,null,null,null,"","J AMYOT","MELUN"]
[2696,null,null,null,null,"","J AMYOT","MELUN"]
[2697,null,null,null,null,"","J AMYOT","MELUN"]
[2698,null,null,null,null,"","J AMYOT","MELUN"]
[2699,null,null,null,null,"","J AMYOT","MELUN"]
[2700,null,null,null,null,"","J AMYOT","MELUN"]
[2701,"LE PELTIER","elie",2006,"G","BG1","J D'ARC","MELUN"]
[2702,"AURIOL","hadrien",2005,"G","BG1","J D'ARC","MELUN"]
[2703,"ERCOL","eloan",2005,"F","BF1","J D'ARC","MELUN"]
[2704,"BENKAIDA ","yanis",2005,"G","BG1","J D'ARC","MELUN"]
[2705,"AIT ISSIMOUR","sofia",2005,"F","BF1","J D'ARC","MELUN"]
[2706,"TRINH","tristan",2005,"G","BG1","J D'ARC","MELUN"]
[2707,"TARAUD","manon",2005,"F","BF1","J D'ARC","MELUN"]
[2708,"VIREVIALLE","justine",2002,"F","MF","J D'ARC","MELUN"]
[2709,"PALUMBO","chloé",2003,"F","MF","J D'ARC","MELUN"]
[2710,"DUCHAMPS","romain",2005,"G","BG1","J D'ARC","MELUN"]
[2711,"PETILLAT","laura",2005,"F","BF1","J D'ARC","MELUN"]
[2712,"BOULLET","guillaume",2003,"G","MG","J D'ARC","MELUN"]
[2713,"KERNANET","victor",2005,"G","BG1","J D'ARC","MELUN"]
[2714,"BAGUIDY","samuel",2005,"G","BG1","J D'ARC","MELUN"]
[2715,"REYMOND","alexandre",2004,"G","BG2","J D'ARC","MELUN"]
[2716,"MERARIO","laurine",2005,"F","BF1","J D'ARC","MELUN"]
[2717,"SANTIAGO","lois",2005,"f","BF1","J D'ARC","MELUN"]
[2718,"BANTEGNY","diane",2005,"F","BF1","J D'ARC","MELUN"]
[2719,"SEMAN","jalid",2005,"G","BG1","J D'ARC","MELUN"]
[2720,"LUKOMBO","nathan",2005,"G","BG1","J D'ARC","MELUN"]
[2721,"WANSTER","willy",2002,"G","MG","J D'ARC","MELUN"]
[2722,"POREE","kyllian",2005,"G","BG1","J D'ARC","MELUN"]
[2723,"PERRIN","mathieu",2004,"G","BG2","J D'ARC","MELUN"]
[2724,"WANSTER","alexis",2004,"G","BG2","J D'ARC","MELUN"]
[2725,"ROGER","vianney",2003,"G","MG","J D'ARC","MELUN"]
[2726,"CHAILLOT","paul",2005,"G","BG1","J D'ARC","MELUN"]
[2727,"VERGER","auriane",2005,"F","BF1","J D'ARC","MELUN"]
[2728,"PALUMBO","alexandre",2005,"G","BG1","J D'ARC","MELUN"]
[2729,"AIME","amélie",2005,"F","BF1","J D'ARC","MELUN"]
[2730,"LETORT","rémi",2003,"G","MG","J D'ARC","MELUN"]
[2731,"LETORT","clément",2005,"G","BG1","J D'ARC","MELUN"]
[2732,"MASSON","enguérand",2003,"G","MG","J D'ARC","MELUN"]
[2733,"STAGNARO","lucie",2006,"F","BF1","J D'ARC","MELUN"]
[2734,"MUNGALA","harmonie",2005,"F","BF1","J D'ARC","MELUN"]
[2735,"BRUNEAU","esteban",2003,"G","MG","J D'ARC","MELUN"]
[2736,"BICICI","dilber",2005,"f","BF1","J D'ARC","MELUN"]
[2737,"DOUTRELON","jules",2005,"G","BG1","J D'ARC","MELUN"]
[2738,"BENALI","ylies",2005,"G","BG1","J D'ARC","MELUN"]
[2739,"PRADO","martin",2005,"G","BG1","J D'ARC","MELUN"]
[2740,"DELMAS","baptiste",2005,"G","BG1","J D'ARC","MELUN"]
[2741,"LEFEVRE","joris",2005,"G","BG1","J D'ARC","MELUN"]
[2742,"GOUJON","yannis",2005,"G","BG1","J D'ARC","MELUN"]
[2743,"MENCIAS","thomas",2005,"G","BG1","J D'ARC","MELUN"]
[2744,"MALLIERE","ludovic",2005,"G","BG1","J D'ARC","MELUN"]
[2745,"DUBOUDIN-REBOUX","garence",2005,"F","BF1","J D'ARC","MELUN"]
[2746,"MERCIRIS","laurine",2005,"F","BF1","J D'ARC","MELUN"]
[2747,"MONNIER","constance",2005,"F","BF1","J D'ARC","MELUN"]
[2748,"LICATA","tess",2005,"F","BF1","J D'ARC","MELUN"]
[2749,"GONNET","maialan",2005,"F","BF1","J D'ARC","MELUN"]
[2750,"COFRECES","elise",2005,"F","BF1","J D'ARC","MELUN"]
[2751,"REX SUBEDIRAH","auphelie",2005,"F","BF1","J D'ARC","MELUN"]
[2752,"FAHIM","shaima",2005,"F","BF1","J D'ARC","MELUN"]
[2753,null,null,null,null,{"$f":"IF(D2754=\"\",\"\",IF(E2754=\"f\",LOOKUP(D2754,cat_unss,cat_f),LOOKUP(D2754,cat_unss,cat_g)))","v":""},"J D'ARC","MELUN"]
[2754,null,null,null,null,"","J D'ARC","MELUN"]
[2755,null,null,null,null,"","J D'ARC","MELUN"]
[2756,null,null,null,null,"","J D'ARC","MELUN"]
[2757,null,null,null,null,"","J D'ARC","MELUN"]
[2758,null,null,null,null,"","J D'ARC","MELUN"]
[2759,null,null,null,null,"","J D'ARC","MELUN"]
[2760,null,null,null,null,"","J D'ARC","MELUN"]
[2761,null,null,null,null,"","J D'ARC","MELUN"]
[2762,null,null,null,null,"","J D'ARC","MELUN"]
[2763,null,null,null,null,"","J D'ARC","MELUN"]
[2764,null,null,null,null,"","J D'ARC","MELUN"]
[2765,null,null,null,null,"","J D'ARC","MELUN"]
[2766,null,null,null,null,"","J D'ARC","MELUN"]
[2767,null,null,null,null,"","J D'ARC","MELUN"]
[2768,null,null,null,null,"","J D'ARC","MELUN"]
[2769,null,null,null,null,"","J D'ARC","MELUN"]
[2770,null,null,null,null,"","J D'ARC","MELUN"]
[2771,null,null,null,null,"","J D'ARC","MELUN"]
[2772,null,null,null,null,"","J D'ARC","MELUN"]
[2773,null,null,null,null,"","J D'ARC","MELUN"]
[2774,null,null,null,null,"","J D'ARC","MELUN"]
[2775,null,null,null,null,"","J D'ARC","MELUN"]
[2776,null,null,null,null,"","J D'ARC","MELUN"]
[2777,null,null,null,null,"","J D'ARC","MELUN"]
[2778,null,null,null,null,"","J D'ARC","MELUN"]
[2779,null,null,null,null,"","J D'ARC","MELUN"]
[2780,null,null,null,null,"","J D'ARC","MELUN"]
[2781,null,null,null,null,"","J D'ARC","MELUN"]
[2782,null,null,null,null,"","J D'ARC","MELUN"]
[2783,null,null,null,null,"","J D'ARC","MELUN"]
[2784,null,null,null,null,"","J D'ARC","MELUN"]
[2785,null,null,null,null,"","J D'ARC","MELUN"]
[2786,null,null,null,null,"","J D'ARC","MELUN"]
[2787,null,null,null,null,"","J D'ARC","MELUN"]
[2788,null,null,null,null,"","J D'ARC","MELUN"]
[2789,null,null,null,null,"","J D'ARC","MELUN"]
[2790,null,null,null,null,"","J D'ARC","MELUN"]
[2791,null,null,null,null,"","J D'ARC","MELUN"]
[2792,null,null,null,null,"","J D'ARC","MELUN"]
[2793,null,null,null,null,"","J D'ARC","MELUN"]
[2794,null,null,null,null,"","J D'ARC","MELUN"]
[2795,null,null,null,null,"","J D'ARC","MELUN"]
[2796,null,null,null,null,"","J D'ARC","MELUN"]
[2797,null,null,null,null,"","J D'ARC","MELUN"]
[2798,null,null,null,null,"","J D'ARC","MELUN"]
[2799,null,null,null,null,"","J D'ARC","MELUN"]
[2800,null,null,null,null,"","J D'ARC","MELUN"]
[2801,null,null,null,null,"","J D'ARC","MELUN"]
[2802,null,null,null,null,"","J D'ARC","MELUN"]
[2803,null,null,null,null,"","J D'ARC","MELUN"]
[2804,null,null,null,null,"","J D'ARC","MELUN"]
[2805,null,null,null,null,"","J D'ARC","MELUN"]
[2806,null,null,null,null,"","J D'ARC","MELUN"]
[2807,null,null,null,null,"","J D'ARC","MELUN"]
[2808,null,null,null,null,"","J D'ARC","MELUN"]
[2809,null,null,null,null,"","J D'ARC","MELUN"]
[2810,null,null,null,null,"","J D'ARC","MELUN"]
[2811,null,null,null,null,"","J D'ARC","MELUN"]
[2812,null,null,null,null,"","J D'ARC","MELUN"]
[2813,null,null,null,null,"","J D'ARC","MELUN"]
[2814,null,null,null,null,"","J D'ARC","MELUN"]
[2815,null,null,null,null,"","J D'ARC","MELUN"]
[2816,null,null,null,null,"","J D'ARC","MELUN"]
[2817,null,null,null,null,{"$f":"IF(D2818=\"\",\"\",IF(E2818=\"f\",LOOKUP(D2818,cat_unss,cat_f),LOOKUP(D2818,cat_unss,cat_g)))","v":""},"J D'ARC","MELUN"]
[2818,null,null,null,null,"","J D'ARC","MELUN"]
[2819,null,null,null,null,"","J D'ARC","MELUN"]
[2820,null,null,null,null,"","J D'ARC","MELUN"]
[2821,null,null,null,null,"","J D'ARC","MELUN"]
[2822,null,null,null,null,"","J D'ARC","MELUN"]
[2823,null,null,null,null,"","J D'ARC","MELUN"]
[2824,null,null,null,null,"","J D'ARC","MELUN"]
[2825,null,null,null,null,"","J D'ARC","MELUN"]
[2826,null,null,null,null,"","J D'ARC","MELUN"]
[2827,null,null,null,null,"","J D'ARC","MELUN"]
[2828,null,null,null,null,"","J D'ARC","MELUN"]
[2829,null,null,null,null,"","J D'ARC","MELUN"]
[2830,null,null,null,null,"","J D'ARC","MELUN"]
[2831,null,null,null,null,"","J D'ARC","MELUN"]
[2832,null,null,null,null,"","J D'ARC","MELUN"]
[2833,null,null,null,null,"","J D'ARC","MELUN"]
[2834,null,null,null,null,"","J D'ARC","MELUN"]
[2835,null,null,null,null,"","J D'ARC","MELUN"]
[2836,null,null,null,null,"","J D'ARC","MELUN"]
[2837,null,null,null,null,"","J D'ARC","MELUN"]
[2838,null,null,null,null,"","J D'ARC","MELUN"]
[2839,null,null,null,null,"","J D'ARC","MELUN"]
[2840,null,null,null,null,"","J D'ARC","MELUN"]
[2841,null,null,null,null,"","J D'ARC","MELUN"]
[2842,null,null,null,null,"","J D'ARC","MELUN"]
[2843,null,null,null,null,"","J D'ARC","MELUN"]
[2844,null,null,null,null,"","J D'ARC","MELUN"]
[2845,null,null,null,null,"","J D'ARC","MELUN"]
[2846,null,null,null,null,"","J D'ARC","MELUN"]
[2847,null,null,null,null,"","J D'ARC","MELUN"]
[2848,null,null,null,null,"","J D'ARC","MELUN"]
[2849,null,null,null,null,"","J D'ARC","MELUN"]
[2850,null,null,null,null,"","J D'ARC","MELUN"]
[2851,null,null,null,null,"","J D'ARC","MELUN"]
[2852,null,null,null,null,"","J D'ARC","MELUN"]
[2853,null,null,null,null,"","J D'ARC","MELUN"]
[2854,null,null,null,null,"","J D'ARC","MELUN"]
[2855,null,null,null,null,"","J D'ARC","MELUN"]
[2856,null,null,null,null,"","J D'ARC","MELUN"]
[2857,null,null,null,null,"","J D'ARC","MELUN"]
[2858,null,null,null,null,"","J D'ARC","MELUN"]
[2859,null,null,null,null,"","J D'ARC","MELUN"]
[2860,null,null,null,null,"","J D'ARC","MELUN"]
[2861,null,null,null,null,"","J D'ARC","MELUN"]
[2862,null,null,null,null,"","J D'ARC","MELUN"]
[2863,null,null,null,null,"","J D'ARC","MELUN"]
[2864,null,null,null,null,"","J D'ARC","MELUN"]
[2865,null,null,null,null,"","J D'ARC","MELUN"]
[2866,null,null,null,null,"","J D'ARC","MELUN"]
[2867,null,null,null,null,"","J D'ARC","MELUN"]
[2868,null,null,null,null,"","J D'ARC","MELUN"]
[2869,null,null,null,null,"","J D'ARC","MELUN"]
[2870,null,null,null,null,"","J D'ARC","MELUN"]
[2871,null,null,null,null,"","J D'ARC","MELUN"]
[2872,null,null,null,null,"","J D'ARC","MELUN"]
[2873,null,null,null,null,"","J D'ARC","MELUN"]
[2874,null,null,null,null,"","J D'ARC","MELUN"]
[2875,null,null,null,null,"","J D'ARC","MELUN"]
[2876,null,null,null,null,"","J D'ARC","MELUN"]
[2877,null,null,null,null,"","J D'ARC","MELUN"]
[2878,null,null,null,null,"","J D'ARC","MELUN"]
[2879,null,null,null,null,"","J D'ARC","MELUN"]
[2880,null,null,null,null,"","J D'ARC","MELUN"]
[2881,null,null,null,null,{"$f":"IF(D2882=\"\",\"\",IF(E2882=\"f\",LOOKUP(D2882,cat_unss,cat_f),LOOKUP(D2882,cat_unss,cat_g)))","v":""},"J D'ARC","MELUN"]
[2882,null,null,null,null,"","J D'ARC","MELUN"]
[2883,null,null,null,null,"","J D'ARC","MELUN"]
[2884,null,null,null,null,"","J D'ARC","MELUN"]
[2885,null,null,null,null,"","J D'ARC","MELUN"]
[2886,null,null,null,null,"","J D'ARC","MELUN"]
[2887,null,null,null,null,"","J D'ARC","MELUN"]
[2888,null,null,null,null,"","J D'ARC","MELUN"]
[2889,null,null,null,null,"","J D'ARC","MELUN"]
[2890,null,null,null,null,"","J D'ARC","MELUN"]
[2891,null,null,null,null,"","J D'ARC","MELUN"]
[2892,null,null,null,null,"","J D'ARC","MELUN"]
[2893,null,null,null,null,"","J D'ARC","MELUN"]
[2894,null,null,null,null,"","J D'ARC","MELUN"]
[2895,null,null,null,null,"","J D'ARC","MELUN"]
[2896,null,null,null,null,"","J D'ARC","MELUN"]
[2897,null,null,null,null,"","J D'ARC","MELUN"]
[2898,null,null,null,null,"","J D'ARC","MELUN"]
[2899,null,null,null,null,"","J D'ARC","MELUN"]
[2900,null,null,null,null,"","J D'ARC","MELUN"]
[2901,null,null,null,null,"","J D'ARC","MELUN"]
[2902,null,null,null,null,"","J D'ARC","MELUN"]
[2903,null,null,null,null,"","J D'ARC","MELUN"]
[2904,null,null,null,null,"","J D'ARC","MELUN"]
[2905,null,null,null,null,"","J D'ARC","MELUN"]
[2906,null,null,null,null,"","J D'ARC","MELUN"]
[2907,null,null,null,null,"","J D'ARC","MELUN"]
[2908,null,null,null,null,"","J D'ARC","MELUN"]
[2909,null,null,null,null,"","J D'ARC","MELUN"]
[2910,null,null,null,null,"","J D'ARC","MELUN"]
[2911,null,null,null,null,"","J D'ARC","MELUN"]
[2912,null,null,null,null,"","J D'ARC","MELUN"]
[2913,null,null,null,null,"","J D'ARC","MELUN"]
[2914,null,null,null,null,"","J D'ARC","MELUN"]
[2915,null,null,null,null,"","J D'ARC","MELUN"]
[2916,null,null,null,null,"","J D'ARC","MELUN"]
[2917,null,null,null,null,"","J D'ARC","MELUN"]
[2918,null,null,null,null,"","J D'ARC","MELUN"]
[2919,null,null,null,null,"","J D'ARC","MELUN"]
[2920,null,null,null,null,"","J D'ARC","MELUN"]
[2921,null,null,null,null,"","J D'ARC","MELUN"]
[2922,null,null,null,null,"","J D'ARC","MELUN"]
[2923,null,null,null,null,"","J D'ARC","MELUN"]
[2924,null,null,null,null,"","J D'ARC","MELUN"]
[2925,null,null,null,null,"","J D'ARC","MELUN"]
[2926,null,null,null,null,"","J D'ARC","MELUN"]
[2927,null,null,null,null,"","J D'ARC","MELUN"]
[2928,null,null,null,null,"","J D'ARC","MELUN"]
[2929,null,null,null,null,"","J D'ARC","MELUN"]
[2930,null,null,null,null,"","J D'ARC","MELUN"]
[2931,null,null,null,null,"","J D'ARC","MELUN"]
[2932,null,null,null,null,"","J D'ARC","MELUN"]
[2933,null,null,null,null,"","J D'ARC","MELUN"]
[2934,null,null,null,null,"","J D'ARC","MELUN"]
[2935,null,null,null,null,"","J D'ARC","MELUN"]
[2936,null,null,null,null,"","J D'ARC","MELUN"]
[2937,null,null,null,null,"","J D'ARC","MELUN"]
[2938,null,null,null,null,"","J D'ARC","MELUN"]
[2939,null,null,null,null,"","J D'ARC","MELUN"]
[2940,null,null,null,null,"","J D'ARC","MELUN"]
[2941,null,null,null,null,"","J D'ARC","MELUN"]
[2942,null,null,null,null,"","J D'ARC","MELUN"]
[2943,null,null,null,null,"","J D'ARC","MELUN"]
[2944,null,null,null,null,"","J D'ARC","MELUN"]
[2945,null,null,null,null,{"$f":"IF(D2946=\"\",\"\",IF(E2946=\"f\",LOOKUP(D2946,cat_unss,cat_f),LOOKUP(D2946,cat_unss,cat_g)))","v":""},"J D'ARC","MELUN"]
[2946,null,null,null,null,"","J D'ARC","MELUN"]
[2947,null,null,null,null,"","J D'ARC","MELUN"]
[2948,null,null,null,null,"","J D'ARC","MELUN"]
[2949,null,null,null,null,"","J D'ARC","MELUN"]
[2950,null,null,null,null,"","J D'ARC","MELUN"]
[2951,null,null,null,null,"","J D'ARC","MELUN"]
[2952,null,null,null,null,"","J D'ARC","MELUN"]
[2953,null,null,null,null,"","J D'ARC","MELUN"]
[2954,null,null,null,null,"","J D'ARC","MELUN"]
[2955,null,null,null,null,"","J D'ARC","MELUN"]
[2956,null,null,null,null,"","J D'ARC","MELUN"]
[2957,null,null,null,null,"","J D'ARC","MELUN"]
[2958,null,null,null,null,"","J D'ARC","MELUN"]
[2959,null,null,null,null,"","J D'ARC","MELUN"]
[2960,null,null,null,null,"","J D'ARC","MELUN"]
[2961,null,null,null,null,"","J D'ARC","MELUN"]
[2962,null,null,null,null,"","J D'ARC","MELUN"]
[2963,null,null,null,null,"","J D'ARC","MELUN"]
[2964,null,null,null,null,"","J D'ARC","MELUN"]
[2965,null,null,null,null,"","J D'ARC","MELUN"]
[2966,null,null,null,null,"","J D'ARC","MELUN"]
[2967,null,null,null,null,"","J D'ARC","MELUN"]
[2968,null,null,null,null,"","J D'ARC","MELUN"]
[2969,null,null,null,null,"","J D'ARC","MELUN"]
[2970,null,null,null,null,"","J D'ARC","MELUN"]
[2971,null,null,null,null,"","J D'ARC","MELUN"]
[2972,null,null,null,null,"","J D'ARC","MELUN"]
[2973,null,null,null,null,"","J D'ARC","MELUN"]
[2974,null,null,null,null,"","J D'ARC","MELUN"]
[2975,null,null,null,null,"","J D'ARC","MELUN"]
[2976,null,null,null,null,"","J D'ARC","MELUN"]
[2977,null,null,null,null,"","J D'ARC","MELUN"]
[2978,null,null,null,null,"","J D'ARC","MELUN"]
[2979,null,null,null,null,"","J D'ARC","MELUN"]
[2980,null,null,null,null,"","J D'ARC","MELUN"]
[2981,null,null,null,null,"","J D'ARC","MELUN"]
[2982,null,null,null,null,"","J D'ARC","MELUN"]
[2983,null,null,null,null,"","J D'ARC","MELUN"]
[2984,null,null,null,null,"","J D'ARC","MELUN"]
[2985,null,null,null,null,"","J D'ARC","MELUN"]
[2986,null,null,null,null,"","J D'ARC","MELUN"]
[2987,null,null,null,null,"","J D'ARC","MELUN"]
[2988,null,null,null,null,"","J D'ARC","MELUN"]
[2989,null,null,null,null,"","J D'ARC","MELUN"]
[2990,null,null,null,null,"","J D'ARC","MELUN"]
[2991,null,null,null,null,"","J D'ARC","MELUN"]
[2992,null,null,null,null,"","J D'ARC","MELUN"]
[2993,null,null,null,null,"","J D'ARC","MELUN"]
[2994,null,null,null,null,"","J D'ARC","MELUN"]
[2995,null,null,null,null,"","J D'ARC","MELUN"]
[2996,null,null,null,null,"","J D'ARC","MELUN"]
[2997,null,null,null,null,"","J D'ARC","MELUN"]
[2998,null,null,null,null,"","J D'ARC","MELUN"]
[2999,null,null,null,null,"","J D'ARC","MELUN"]
[3000,null,null,null,null,"","J D'ARC","MELUN"]
[3001,"SAMBA","Aymey Rachel",2005,"F","BF1","LA FONTAINE","LE MEE"]
[3002,"SAMBA","Aymey Sarah",2005,"F","BF1","LA FONTAINE","LE MEE"]
[3003,"BOURDIN","Tony",2005,"G","BG1","LA FONTAINE","LE MEE"]
[3004,"GUILLEMIN","Quentin",2005,"G","BG1","LA FONTAINE","LE MEE"]
[3005,"COULIBALY","Assya",2004,"F","BF2","LA FONTAINE","LE MEE"]
[3006,"RHENZOUR","Soumaya",2003,"F","MF","LA FONTAINE","LE MEE"]
[3007,"ROGIER","Manuella",2003,"F","MF","LA FONTAINE","LE MEE"]
[3008,"AHMADA","Nahil",2005,"G","BG1","LA FONTAINE","LE MEE"]
[3009,"BATCHAKOUI","Keyana",2005,"F",{"$f":"IF(D3010=\"\",\"\",IF(E3010=\"f\",LOOKUP(D3010,cat_unss,cat_f),LOOKUP(D3010,cat_unss,cat_g)))","v":"BF1"},"LA FONTAINE","LE MEE"]
[3010,"GATOUFI","Malek",2002,"G","MG","LA FONTAINE","LE MEE"]
[3011,"ABDEL WEDOUD","Zeinabou",2003,"F","MF","LA FONTAINE","LE MEE"]
[3012,"BENSAID","Amira",2002,"F","MF","LA FONTAINE","LE MEE"]
[3013,null,null,null,null,"","LA FONTAINE","LE MEE"]
[3014,null,null,null,null,"","LA FONTAINE","LE MEE"]
[3015,null,null,null,null,"","LA FONTAINE","LE MEE"]
[3016,null,null,null,null,"","LA FONTAINE","LE MEE"]
[3017,null,null,null,null,"","LA FONTAINE","LE MEE"]
[3018,null,null,null,null,"","LA FONTAINE","LE MEE"]
[3019,null,null,null,null,"","LA FONTAINE","LE MEE"]
[3020,null,null,null,null,"","LA FONTAINE","LE MEE"]
[3021,null,null,null,null,"","LA FONTAINE","LE MEE"]
[3022,null,null,null,null,"","LA FONTAINE","LE MEE"]
[3023,null,null,null,null,"","LA FONTAINE","LE MEE"]
[3024,null,null,null,null,"","LA FONTAINE","LE MEE"]
[3025,null,null,null,null,"","LA FONTAINE","LE MEE"]
[3026,null,null,null,null,"","LA FONTAINE","LE MEE"]
[3027,null,null,null,null,"","LA FONTAINE","LE MEE"]
[3028,null,null,null,null,"","LA FONTAINE","LE MEE"]
[3029,null,null,null,null,"","LA FONTAINE","LE MEE"]
[3030,null,null,null,null,"","LA FONTAINE","LE MEE"]
[3031,null,null,null,null,"","LA FONTAINE","LE MEE"]
[3032,null,null,null,null,"","LA FONTAINE","LE MEE"]
[3033,null,null,null,null,"","LA FONTAINE","LE MEE"]
[3034,null,null,null,null,"","LA FONTAINE","LE MEE"]
[3035,null,null,null,null,"","LA FONTAINE","LE MEE"]
[3036,null,null,null,null,"","LA FONTAINE","LE MEE"]
[3037,null,null,null,null,"","LA FONTAINE","LE MEE"]
[3038,null,null,null,null,"","LA FONTAINE","LE MEE"]
[3039,null,null,null,null,"","LA FONTAINE","LE MEE"]
[3040,null,null,null,null,"","LA FONTAINE","LE MEE"]
[3041,null,null,null,null,"","LA FONTAINE","LE MEE"]
[3042,null,null,null,null,"","LA FONTAINE","LE MEE"]
[3043,null,null,null,null,"","LA FONTAINE","LE MEE"]
[3044,null,null,null,null,"","LA FONTAINE","LE MEE"]
[3045,null,null,null,null,"","LA FONTAINE","LE MEE"]
[3046,null,null,null,null,"","LA FONTAINE","LE MEE"]
[3047,null,null,null,null,"","LA FONTAINE","LE MEE"]
[3048,null,null,null,null,"","LA FONTAINE","LE MEE"]
[3049,null,null,null,null,"","LA FONTAINE","LE MEE"]
[3050,null,null,null,null,"","LA FONTAINE","LE MEE"]
[3051,null,null,null,null,"","LA FONTAINE","LE MEE"]
[3052,null,null,null,null,"","LA FONTAINE","LE MEE"]
[3053,null,null,null,null,"","LA FONTAINE","LE MEE"]
[3054,null,null,null,null,"","LA FONTAINE","LE MEE"]
[3055,null,null,null,null,"","LA FONTAINE","LE MEE"]
[3056,null,null,null,null,"","LA FONTAINE","LE MEE"]
[3057,null,null,null,null,"","LA FONTAINE","LE MEE"]
[3058,null,null,null,null,"","LA FONTAINE","LE MEE"]
[3059,null,null,null,null,"","LA FONTAINE","LE MEE"]
[3060,null,null,null,null,"","LA FONTAINE","LE MEE"]
[3061,null,null,null,null,"","LA FONTAINE","LE MEE"]
[3062,null,null,null,null,"","LA FONTAINE","LE MEE"]
[3063,null,null,null,null,"","LA FONTAINE","LE MEE"]
[3064,null,null,null,null,"","LA FONTAINE","LE MEE"]
[3065,null,null,null,null,"","LA FONTAINE","LE MEE"]
[3066,null,null,null,null,"","LA FONTAINE","LE MEE"]
[3067,null,null,null,null,"","LA FONTAINE","LE MEE"]
[3068,null,null,null,null,"","LA FONTAINE","LE MEE"]
[3069,null,null,null,null,"","LA FONTAINE","LE MEE"]
[3070,null,null,null,null,"","LA FONTAINE","LE MEE"]
[3071,null,null,null,null,"","LA FONTAINE","LE MEE"]
[3072,null,null,null,null,"","LA FONTAINE","LE MEE"]
[3073,null,null,null,null,{"$f":"IF(D3074=\"\",\"\",IF(E3074=\"f\",LOOKUP(D3074,cat_unss,cat_f),LOOKUP(D3074,cat_unss,cat_g)))","v":""},"LA FONTAINE","LE MEE"]
[3074,null,null,null,null,"","LA FONTAINE","LE MEE"]
[3075,null,null,null,null,"","LA FONTAINE","LE MEE"]
[3076,null,null,null,null,"","LA FONTAINE","LE MEE"]
[3077,null,null,null,null,"","LA FONTAINE","LE MEE"]
[3078,null,null,null,null,"","LA FONTAINE","LE MEE"]
[3079,null,null,null,null,"","LA FONTAINE","LE MEE"]
[3080,null,null,null,null,"","LA FONTAINE","LE MEE"]
[3081,null,null,null,null,"","LA FONTAINE","LE MEE"]
[3082,null,null,null,null,"","LA FONTAINE","LE MEE"]
[3083,null,null,null,null,"","LA FONTAINE","LE MEE"]
[3084,null,null,null,null,"","LA FONTAINE","LE MEE"]
[3085,null,null,null,null,"","LA FONTAINE","LE MEE"]
[3086,null,null,null,null,"","LA FONTAINE","LE MEE"]
[3087,null,null,null,null,"","LA FONTAINE","LE MEE"]
[3088,null,null,null,null,"","LA FONTAINE","LE MEE"]
[3089,null,null,null,null,"","LA FONTAINE","LE MEE"]
[3090,null,null,null,null,"","LA FONTAINE","LE MEE"]
[3091,null,null,null,null,"","LA FONTAINE","LE MEE"]
[3092,null,null,null,null,"","LA FONTAINE","LE MEE"]
[3093,null,null,null,null,"","LA FONTAINE","LE MEE"]
[3094,null,null,null,null,"","LA FONTAINE","LE MEE"]
[3095,null,null,null,null,"","LA FONTAINE","LE MEE"]
[3096,null,null,null,null,"","LA FONTAINE","LE MEE"]
[3097,null,null,null,null,"","LA FONTAINE","LE MEE"]
[3098,null,null,null,null,"","LA FONTAINE","LE MEE"]
[3099,null,null,null,null,"","LA FONTAINE","LE MEE"]
[3100,null,null,null,null,"","LA FONTAINE","LE MEE"]
[3101,null,null,null,null,"","LA FONTAINE","LE MEE"]
[3102,null,null,null,null,"","LA FONTAINE","LE MEE"]
[3103,null,null,null,null,"","LA FONTAINE","LE MEE"]
[3104,null,null,null,null,"","LA FONTAINE","LE MEE"]
[3105,null,null,null,null,"","LA FONTAINE","LE MEE"]
[3106,null,null,null,null,"","LA FONTAINE","LE MEE"]
[3107,null,null,null,null,"","LA FONTAINE","LE MEE"]
[3108,null,null,null,null,"","LA FONTAINE","LE MEE"]
[3109,null,null,null,null,"","LA FONTAINE","LE MEE"]
[3110,null,null,null,null,"","LA FONTAINE","LE MEE"]
[3111,null,null,null,null,"","LA FONTAINE","LE MEE"]
[3112,null,null,null,null,"","LA FONTAINE","LE MEE"]
[3113,null,null,null,null,"","LA FONTAINE","LE MEE"]
[3114,null,null,null,null,"","LA FONTAINE","LE MEE"]
[3115,null,null,null,null,"","LA FONTAINE","LE MEE"]
[3116,null,null,null,null,"","LA FONTAINE","LE MEE"]
[3117,null,null,null,null,"","LA FONTAINE","LE MEE"]
[3118,null,null,null,null,"","LA FONTAINE","LE MEE"]
[3119,null,null,null,null,"","LA FONTAINE","LE MEE"]
[3120,null,null,null,null,"","LA FONTAINE","LE MEE"]
[3121,null,null,null,null,"","LA FONTAINE","LE MEE"]
[3122,null,null,null,null,"","LA FONTAINE","LE MEE"]
[3123,null,null,null,null,"","LA FONTAINE","LE MEE"]
[3124,null,null,null,null,"","LA FONTAINE","LE MEE"]
[3125,null,null,null,null,"","LA FONTAINE","LE MEE"]
[3126,null,null,null,null,"","LA FONTAINE","LE MEE"]
[3127,null,null,null,null,"","LA FONTAINE","LE MEE"]
[3128,null,null,null,null,"","LA FONTAINE","LE MEE"]
[3129,null,null,null,null,"","LA FONTAINE","LE MEE"]
[3130,null,null,null,null,"","LA FONTAINE","LE MEE"]
[3131,null,null,null,null,"","LA FONTAINE","LE MEE"]
[3132,null,null,null,null,"","LA FONTAINE","LE MEE"]
[3133,null,null,null,null,"","LA FONTAINE","LE MEE"]
[3134,null,null,null,null,"","LA FONTAINE","LE MEE"]
[3135,null,null,null,null,"","LA FONTAINE","LE MEE"]
[3136,null,null,null,null,"","LA FONTAINE","LE MEE"]
[3137,null,null,null,null,{"$f":"IF(D3138=\"\",\"\",IF(E3138=\"f\",LOOKUP(D3138,cat_unss,cat_f),LOOKUP(D3138,cat_unss,cat_g)))","v":""},"LA FONTAINE","LE MEE"]
[3138,null,null,null,null,"","LA FONTAINE","LE MEE"]
[3139,null,null,null,null,"","LA FONTAINE","LE MEE"]
[3140,null,null,null,null,"","LA FONTAINE","LE MEE"]
[3141,null,null,null,null,"","LA FONTAINE","LE MEE"]
[3142,null,null,null,null,"","LA FONTAINE","LE MEE"]
[3143,null,null,null,null,"","LA FONTAINE","LE MEE"]
[3144,null,null,null,null,"","LA FONTAINE","LE MEE"]
[3145,null,null,null,null,"","LA FONTAINE","LE MEE"]
[3146,null,null,null,null,"","LA FONTAINE","LE MEE"]
[3147,null,null,null,null,"","LA FONTAINE","LE MEE"]
[3148,null,null,null,null,"","LA FONTAINE","LE MEE"]
[3149,null,null,null,null,"","LA FONTAINE","LE MEE"]
[3150,null,null,null,null,"","LA FONTAINE","LE MEE"]
[3151,null,null,null,null,"","LA FONTAINE","LE MEE"]
[3152,null,null,null,null,"","LA FONTAINE","LE MEE"]
[3153,null,null,null,null,"","LA FONTAINE","LE MEE"]
[3154,null,null,null,null,"","LA FONTAINE","LE MEE"]
[3155,null,null,null,null,"","LA FONTAINE","LE MEE"]
[3156,null,null,null,null,"","LA FONTAINE","LE MEE"]
[3157,null,null,null,null,"","LA FONTAINE","LE MEE"]
[3158,null,null,null,null,"","LA FONTAINE","LE MEE"]
[3159,null,null,null,null,"","LA FONTAINE","LE MEE"]
[3160,null,null,null,null,"","LA FONTAINE","LE MEE"]
[3161,null,null,null,null,"","LA FONTAINE","LE MEE"]
[3162,null,null,null,null,"","LA FONTAINE","LE MEE"]
[3163,null,null,null,null,"","LA FONTAINE","LE MEE"]
[3164,null,null,null,null,"","LA FONTAINE","LE MEE"]
[3165,null,null,null,null,"","LA FONTAINE","LE MEE"]
[3166,null,null,null,null,"","LA FONTAINE","LE MEE"]
[3167,null,null,null,null,"","LA FONTAINE","LE MEE"]
[3168,null,null,null,null,"","LA FONTAINE","LE MEE"]
[3169,null,null,null,null,"","LA FONTAINE","LE MEE"]
[3170,null,null,null,null,"","LA FONTAINE","LE MEE"]
[3171,null,null,null,null,"","LA FONTAINE","LE MEE"]
[3172,null,null,null,null,"","LA FONTAINE","LE MEE"]
[3173,null,null,null,null,"","LA FONTAINE","LE MEE"]
[3174,null,null,null,null,"","LA FONTAINE","LE MEE"]
[3175,null,null,null,null,"","LA FONTAINE","LE MEE"]
[3176,null,null,null,null,"","LA FONTAINE","LE MEE"]
[3177,null,null,null,null,"","LA FONTAINE","LE MEE"]
[3178,null,null,null,null,"","LA FONTAINE","LE MEE"]
[3179,null,null,null,null,"","LA FONTAINE","LE MEE"]
[3180,null,null,null,null,"","LA FONTAINE","LE MEE"]
[3181,null,null,null,null,"","LA FONTAINE","LE MEE"]
[3182,null,null,null,null,"","LA FONTAINE","LE MEE"]
[3183,null,null,null,null,"","LA FONTAINE","LE MEE"]
[3184,null,null,null,null,"","LA FONTAINE","LE MEE"]
[3185,null,null,null,null,"","LA FONTAINE","LE MEE"]
[3186,null,null,null,null,"","LA FONTAINE","LE MEE"]
[3187,null,null,null,null,"","LA FONTAINE","LE MEE"]
[3188,null,null,null,null,"","LA FONTAINE","LE MEE"]
[3189,null,null,null,null,"","LA FONTAINE","LE MEE"]
[3190,null,null,null,null,"","LA FONTAINE","LE MEE"]
[3191,null,null,null,null,"","LA FONTAINE","LE MEE"]
[3192,null,null,null,null,"","LA FONTAINE","LE MEE"]
[3193,null,null,null,null,"","LA FONTAINE","LE MEE"]
[3194,null,null,null,null,"","LA FONTAINE","LE MEE"]
[3195,null,null,null,null,"","LA FONTAINE","LE MEE"]
[3196,null,null,null,null,"","LA FONTAINE","LE MEE"]
[3197,null,null,null,null,"","LA FONTAINE","LE MEE"]
[3198,null,null,null,null,"","LA FONTAINE","LE MEE"]
[3199,null,null,null,null,"","LA FONTAINE","LE MEE"]
[3200,null,null,null,null,"","LA FONTAINE","LE MEE"]
[3201,null,null,null,null,{"$f":"IF(D3202=\"\",\"\",IF(E3202=\"f\",LOOKUP(D3202,cat_unss,cat_f),LOOKUP(D3202,cat_unss,cat_g)))","v":""},"LA FONTAINE","LE MEE"]
[3202,null,null,null,null,"","LA FONTAINE","LE MEE"]
[3203,null,null,null,null,"","LA FONTAINE","LE MEE"]
[3204,null,null,null,null,"","LA FONTAINE","LE MEE"]
[3205,null,null,null,null,"","LA FONTAINE","LE MEE"]
[3206,null,null,null,null,"","LA FONTAINE","LE MEE"]
[3207,null,null,null,null,"","LA FONTAINE","LE MEE"]
[3208,null,null,null,null,"","LA FONTAINE","LE MEE"]
[3209,null,null,null,null,"","LA FONTAINE","LE MEE"]
[3210,null,null,null,null,"","LA FONTAINE","LE MEE"]
[3211,null,null,null,null,"","LA FONTAINE","LE MEE"]
[3212,null,null,null,null,"","LA FONTAINE","LE MEE"]
[3213,null,null,null,null,"","LA FONTAINE","LE MEE"]
[3214,null,null,null,null,"","LA FONTAINE","LE MEE"]
[3215,null,null,null,null,"","LA FONTAINE","LE MEE"]
[3216,null,null,null,null,"","LA FONTAINE","LE MEE"]
[3217,null,null,null,null,"","LA FONTAINE","LE MEE"]
[3218,null,null,null,null,"","LA FONTAINE","LE MEE"]
[3219,null,null,null,null,"","LA FONTAINE","LE MEE"]
[3220,null,null,null,null,"","LA FONTAINE","LE MEE"]
[3221,null,null,null,null,"","LA FONTAINE","LE MEE"]
[3222,null,null,null,null,"","LA FONTAINE","LE MEE"]
[3223,null,null,null,null,"","LA FONTAINE","LE MEE"]
[3224,null,null,null,null,"","LA FONTAINE","LE MEE"]
[3225,null,null,null,null,"","LA FONTAINE","LE MEE"]
[3226,null,null,null,null,"","LA FONTAINE","LE MEE"]
[3227,null,null,null,null,"","LA FONTAINE","LE MEE"]
[3228,null,null,null,null,"","LA FONTAINE","LE MEE"]
[3229,null,null,null,null,"","LA FONTAINE","LE MEE"]
[3230,null,null,null,null,"","LA FONTAINE","LE MEE"]
[3231,null,null,null,null,"","LA FONTAINE","LE MEE"]
[3232,null,null,null,null,"","LA FONTAINE","LE MEE"]
[3233,null,null,null,null,"","LA FONTAINE","LE MEE"]
[3234,null,null,null,null,"","LA FONTAINE","LE MEE"]
[3235,null,null,null,null,"","LA FONTAINE","LE MEE"]
[3236,null,null,null,null,"","LA FONTAINE","LE MEE"]
[3237,null,null,null,null,"","LA FONTAINE","LE MEE"]
[3238,null,null,null,null,"","LA FONTAINE","LE MEE"]
[3239,null,null,null,null,"","LA FONTAINE","LE MEE"]
[3240,null,null,null,null,"","LA FONTAINE","LE MEE"]
[3241,null,null,null,null,"","LA FONTAINE","LE MEE"]
[3242,null,null,null,null,"","LA FONTAINE","LE MEE"]
[3243,null,null,null,null,"","LA FONTAINE","LE MEE"]
[3244,null,null,null,null,"","LA FONTAINE","LE MEE"]
[3245,null,null,null,null,"","LA FONTAINE","LE MEE"]
[3246,null,null,null,null,"","LA FONTAINE","LE MEE"]
[3247,null,null,null,null,"","LA FONTAINE","LE MEE"]
[3248,null,null,null,null,"","LA FONTAINE","LE MEE"]
[3249,null,null,null,null,"","LA FONTAINE","LE MEE"]
[3250,null,null,null,null,"","LA FONTAINE","LE MEE"]
[3251,null,null,null,null,"","LA FONTAINE","LE MEE"]
[3252,null,null,null,null,"","LA FONTAINE","LE MEE"]
[3253,null,null,null,null,"","LA FONTAINE","LE MEE"]
[3254,null,null,null,null,"","LA FONTAINE","LE MEE"]
[3255,null,null,null,null,"","LA FONTAINE","LE MEE"]
[3256,null,null,null,null,"","LA FONTAINE","LE MEE"]
[3257,null,null,null,null,"","LA FONTAINE","LE MEE"]
[3258,null,null,null,null,"","LA FONTAINE","LE MEE"]
[3259,null,null,null,null,"","LA FONTAINE","LE MEE"]
[3260,null,null,null,null,"","LA FONTAINE","LE MEE"]
[3261,null,null,null,null,"","LA FONTAINE","LE MEE"]
[3262,null,null,null,null,"","LA FONTAINE","LE MEE"]
[3263,null,null,null,null,"","LA FONTAINE","LE MEE"]
[3264,null,null,null,null,"","LA FONTAINE","LE MEE"]
[3265,null,null,null,null,{"$f":"IF(D3266=\"\",\"\",IF(E3266=\"f\",LOOKUP(D3266,cat_unss,cat_f),LOOKUP(D3266,cat_unss,cat_g)))","v":""},"LA FONTAINE","LE MEE"]
[3266,null,null,null,null,"","LA FONTAINE","LE MEE"]
[3267,null,null,null,null,"","LA FONTAINE","LE MEE"]
[3268,null,null,null,null,"","LA FONTAINE","LE MEE"]
[3269,null,null,null,null,"","LA FONTAINE","LE MEE"]
[3270,null,null,null,null,"","LA FONTAINE","LE MEE"]
[3271,null,null,null,null,"","LA FONTAINE","LE MEE"]
[3272,null,null,null,null,"","LA FONTAINE","LE MEE"]
[3273,null,null,null,null,"","LA FONTAINE","LE MEE"]
[3274,null,null,null,null,"","LA FONTAINE","LE MEE"]
[3275,null,null,null,null,"","LA FONTAINE","LE MEE"]
[3276,null,null,null,null,"","LA FONTAINE","LE MEE"]
[3277,null,null,null,null,"","LA FONTAINE","LE MEE"]
[3278,null,null,null,null,"","LA FONTAINE","LE MEE"]
[3279,null,null,null,null,"","LA FONTAINE","LE MEE"]
[3280,null,null,null,null,"","LA FONTAINE","LE MEE"]
[3281,null,null,null,null,"","LA FONTAINE","LE MEE"]
[3282,null,null,null,null,"","LA FONTAINE","LE MEE"]
[3283,null,null,null,null,"","LA FONTAINE","LE MEE"]
[3284,null,null,null,null,"","LA FONTAINE","LE MEE"]
[3285,null,null,null,null,"","LA FONTAINE","LE MEE"]
[3286,null,null,null,null,"","LA FONTAINE","LE MEE"]
[3287,null,null,null,null,"","LA FONTAINE","LE MEE"]
[3288,null,null,null,null,"","LA FONTAINE","LE MEE"]
[3289,null,null,null,null,"","LA FONTAINE","LE MEE"]
[3290,null,null,null,null,"","LA FONTAINE","LE MEE"]
[3291,null,null,null,null,"","LA FONTAINE","LE MEE"]
[3292,null,null,null,null,"","LA FONTAINE","LE MEE"]
[3293,null,null,null,null,"","LA FONTAINE","LE MEE"]
[3294,null,null,null,null,"","LA FONTAINE","LE MEE"]
[3295,null,null,null,null,"","LA FONTAINE","LE MEE"]
[3296,null,null,null,null,"","LA FONTAINE","LE MEE"]
[3297,null,null,null,null,"","LA FONTAINE","LE MEE"]
[3298,null,null,null,null,"","LA FONTAINE","LE MEE"]
[3299,null,null,null,null,"","LA FONTAINE","LE MEE"]
[3300,null,null,null,null,"","LA FONTAINE","LE MEE"]
[3301,"SIMONOT","Yann",2004,"G","BG2","LA MARE AUX CHAMPS","VAUX"]
[3302,"SANSON","Malo",2004,"G","BG2","LA MARE AUX CHAMPS","VAUX"]
[3303,"OUAZARI","Mina",2001,"F","CF","LA MARE AUX CHAMPS","VAUX"]
[3304,"AUBINEAU","Dorian",2002,"G","MG","LA MARE AUX CHAMPS","VAUX"]
[3305,"SCHWOERER","Aymeri",2003,"G","MG","LA MARE AUX CHAMPS","VAUX"]
[3306,"SIMONNOT","Axelle",2003,"F","MF","LA MARE AUX CHAMPS","VAUX"]
[3307,"GORGE BERNAT","Clara",2002,"F","MF","LA MARE AUX CHAMPS","VAUX"]
[3308,"ZINGLE","Léna",2005,"F","BF1","LA MARE AUX CHAMPS","VAUX"]
[3309,"DE SOUSA","Lucia",2004,"F","BF2","LA MARE AUX CHAMPS","VAUX"]
[3310,"BRICOUT","Amélien",2004,"G","BG2","LA MARE AUX CHAMPS","VAUX"]
[3311,"KHIAR","Najib",2002,"G","MG","LA MARE AUX CHAMPS","VAUX"]
[3312,"DIONNET","Théo",2002,"G","MG","LA MARE AUX CHAMPS","VAUX"]
[3313,"ALVES DOS SANTOS","Flavio",2005,"G","BG1","LA MARE AUX CHAMPS","VAUX"]
[3314,"MOITIE","Aléxis",2005,"G","BG1","LA MARE AUX CHAMPS","VAUX"]
[3315,"FONTYN","Tiffaine",2005,"F","BF1","LA MARE AUX CHAMPS","VAUX"]
[3316,"KAOUA","Lucie",2005,"F","BF1","LA MARE AUX CHAMPS","VAUX"]
[3317,"GALOPULO","Adam",2004,"G","BG2","LA MARE AUX CHAMPS","VAUX"]
[3318,"GOMEZ CALLO","Gwendoline",2003,"F","MF","LA MARE AUX CHAMPS","VAUX"]
[3319,"CHAMDRYKOWSKA","Arthur",2004,"G","BG2","LA MARE AUX CHAMPS","VAUX"]
[3320,"BADER","Helene",2003,"F","MF","LA MARE AUX CHAMPS","VAUX"]
[3321,"KAOUA","Paul",2003,"G","MG","LA MARE AUX CHAMPS","VAUX"]
[3322,"PAISLEY","Laure",2003,"F","MF","LA MARE AUX CHAMPS","VAUX"]
[3323,"BERTRAND","Cassandra",2003,"F","MF","LA MARE AUX CHAMPS","VAUX"]
[3324,"FERNANDEZ","Elsa",2002,"F","MF","LA MARE AUX CHAMPS","VAUX"]
[3325,"ARTHUS","Venus",2002,"F","MF","LA MARE AUX CHAMPS","VAUX"]
[3326,"KIBWATIAKA","Kilian",2005,"G","BG1","LA MARE AUX CHAMPS","VAUX"]
[3327,"DELCROIX","Enzo",2004,"G","BG2","LA MARE AUX CHAMPS","VAUX"]
[3328,"ANDRIEU","Sidonie",2002,"F","MF","LA MARE AUX CHAMPS","VAUX"]
[3329,"POITTEVIN","Jeanne",2002,"F",{"$f":"IF(D3330=\"\",\"\",IF(E3330=\"f\",LOOKUP(D3330,cat_unss,cat_f),LOOKUP(D3330,cat_unss,cat_g)))","v":"MF"},"LA MARE AUX CHAMPS","VAUX"]
[3330,"DESRUELLES","Lola",2003,"F","MF","LA MARE AUX CHAMPS","VAUX"]
[3331,"COLSON","Aude",2004,"F","BF2","LA MARE AUX CHAMPS","VAUX"]
[3332,"COLSON","Noemie",2004,"F","BF2","LA MARE AUX CHAMPS","VAUX"]
[3333,"BEALOU","Calista",2004,"F","BF2","LA MARE AUX CHAMPS","VAUX"]
[3334,"AUDAT","Moira",2003,"F","MF","LA MARE AUX CHAMPS","VAUX"]
[3335,"DJEBAR","Cassandra",2004,"F","BF2","LA MARE AUX CHAMPS","VAUX"]
[3336,"NOVIER","Nathan",2002,"G","MG","LA MARE AUX CHAMPS","VAUX"]
[3337,"MARTIN","Aléxis",2002,"G","MG","LA MARE AUX CHAMPS","VAUX"]
[3338,"VOYER","Pierre",2002,"G","MG","LA MARE AUX CHAMPS","VAUX"]
[3339,"JATTEAU","Simon",2005,"G","BG1","LA MARE AUX CHAMPS","VAUX"]
[3340,"SZELERSKI","Benoit",2003,"G","MG","LA MARE AUX CHAMPS","VAUX"]
[3341,"TRIQUET","Clara",2004,"F","BF2","LA MARE AUX CHAMPS","VAUX"]
[3342,"BORTOT","Florian",2002,"G","MG","LA MARE AUX CHAMPS","VAUX"]
[3343,"BAVOL","Joan",2004,"G","BG2","LA MARE AUX CHAMPS","VAUX"]
[3344,"LARSONNEUR","Justin",2005,"G","BG1","LA MARE AUX CHAMPS","VAUX"]
[3345,"SOAVE","Carla",2003,"F","MF","LA MARE AUX CHAMPS","VAUX"]
[3346,null,null,null,null,"","LA MARE AUX CHAMPS","VAUX"]
[3347,null,null,null,null,"","LA MARE AUX CHAMPS","VAUX"]
[3348,null,null,null,null,"","LA MARE AUX CHAMPS","VAUX"]
[3349,null,null,null,null,"","LA MARE AUX CHAMPS","VAUX"]
[3350,null,null,null,null,"","LA MARE AUX CHAMPS","VAUX"]
[3351,null,null,null,null,"","LA MARE AUX CHAMPS","VAUX"]
[3352,null,null,null,null,"","LA MARE AUX CHAMPS","VAUX"]
[3353,null,null,null,null,"","LA MARE AUX CHAMPS","VAUX"]
[3354,null,null,null,null,"","LA MARE AUX CHAMPS","VAUX"]
[3355,null,null,null,null,"","LA MARE AUX CHAMPS","VAUX"]
[3356,null,null,null,null,"","LA MARE AUX CHAMPS","VAUX"]
[3357,null,null,null,null,"","LA MARE AUX CHAMPS","VAUX"]
[3358,null,null,null,null,"","LA MARE AUX CHAMPS","VAUX"]
[3359,null,null,null,null,"","LA MARE AUX CHAMPS","VAUX"]
[3360,null,null,null,null,"","LA MARE AUX CHAMPS","VAUX"]
[3361,null,null,null,null,"","LA MARE AUX CHAMPS","VAUX"]
[3362,null,null,null,null,"","LA MARE AUX CHAMPS","VAUX"]
[3363,null,null,null,null,"","LA MARE AUX CHAMPS","VAUX"]
[3364,null,null,null,null,"","LA MARE AUX CHAMPS","VAUX"]
[3365,null,null,null,null,"","LA MARE AUX CHAMPS","VAUX"]
[3366,null,null,null,null,"","LA MARE AUX CHAMPS","VAUX"]
[3367,null,null,null,null,"","LA MARE AUX CHAMPS","VAUX"]
[3368,null,null,null,null,"","LA MARE AUX CHAMPS","VAUX"]
[3369,null,null,null,null,"","LA MARE AUX CHAMPS","VAUX"]
[3370,null,null,null,null,"","LA MARE AUX CHAMPS","VAUX"]
[3371,null,null,null,null,"","LA MARE AUX CHAMPS","VAUX"]
[3372,null,null,null,null,"","LA MARE AUX CHAMPS","VAUX"]
[3373,null,null,null,null,"","LA MARE AUX CHAMPS","VAUX"]
[3374,null,null,null,null,"","LA MARE AUX CHAMPS","VAUX"]
[3375,null,null,null,null,"","LA MARE AUX CHAMPS","VAUX"]
[3376,null,null,null,null,"","LA MARE AUX CHAMPS","VAUX"]
[3377,null,null,null,null,"","LA MARE AUX CHAMPS","VAUX"]
[3378,null,null,null,null,"","LA MARE AUX CHAMPS","VAUX"]
[3379,null,null,null,null,"","LA MARE AUX CHAMPS","VAUX"]
[3380,null,null,null,null,"","LA MARE AUX CHAMPS","VAUX"]
[3381,null,null,null,null,"","LA MARE AUX CHAMPS","VAUX"]
[3382,null,null,null,null,"","LA MARE AUX CHAMPS","VAUX"]
[3383,null,null,null,null,"","LA MARE AUX CHAMPS","VAUX"]
[3384,null,null,null,null,"","LA MARE AUX CHAMPS","VAUX"]
[3385,null,null,null,null,"","LA MARE AUX CHAMPS","VAUX"]
[3386,null,null,null,null,"","LA MARE AUX CHAMPS","VAUX"]
[3387,null,null,null,null,"","LA MARE AUX CHAMPS","VAUX"]
[3388,null,null,null,null,"","LA MARE AUX CHAMPS","VAUX"]
[3389,null,null,null,null,"","LA MARE AUX CHAMPS","VAUX"]
[3390,null,null,null,null,"","LA MARE AUX CHAMPS","VAUX"]
[3391,null,null,null,null,"","LA MARE AUX CHAMPS","VAUX"]
[3392,null,null,null,null,"","LA MARE AUX CHAMPS","VAUX"]
[3393,null,null,null,null,{"$f":"IF(D3394=\"\",\"\",IF(E3394=\"f\",LOOKUP(D3394,cat_unss,cat_f),LOOKUP(D3394,cat_unss,cat_g)))","v":""},"LA MARE AUX CHAMPS","VAUX"]
[3394,null,null,null,null,"","LA MARE AUX CHAMPS","VAUX"]
[3395,null,null,null,null,"","LA MARE AUX CHAMPS","VAUX"]
[3396,null,null,null,null,"","LA MARE AUX CHAMPS","VAUX"]
[3397,null,null,null,null,"","LA MARE AUX CHAMPS","VAUX"]
[3398,null,null,null,null,"","LA MARE AUX CHAMPS","VAUX"]
[3399,null,null,null,null,"","LA MARE AUX CHAMPS","VAUX"]
[3400,null,null,null,null,"","LA MARE AUX CHAMPS","VAUX"]
[3401,null,null,null,null,"","LA MARE AUX CHAMPS","VAUX"]
[3402,null,null,null,null,"","LA MARE AUX CHAMPS","VAUX"]
[3403,null,null,null,null,"","LA MARE AUX CHAMPS","VAUX"]
[3404,null,null,null,null,"","LA MARE AUX CHAMPS","VAUX"]
[3405,null,null,null,null,"","LA MARE AUX CHAMPS","VAUX"]
[3406,null,null,null,null,"","LA MARE AUX CHAMPS","VAUX"]
[3407,null,null,null,null,"","LA MARE AUX CHAMPS","VAUX"]
[3408,null,null,null,null,"","LA MARE AUX CHAMPS","VAUX"]
[3409,null,null,null,null,"","LA MARE AUX CHAMPS","VAUX"]
[3410,null,null,null,null,"","LA MARE AUX CHAMPS","VAUX"]
[3411,null,null,null,null,"","LA MARE AUX CHAMPS","VAUX"]
[3412,null,null,null,null,"","LA MARE AUX CHAMPS","VAUX"]
[3413,null,null,null,null,"","LA MARE AUX CHAMPS","VAUX"]
[3414,null,null,null,null,"","LA MARE AUX CHAMPS","VAUX"]
[3415,null,null,null,null,"","LA MARE AUX CHAMPS","VAUX"]
[3416,null,null,null,null,"","LA MARE AUX CHAMPS","VAUX"]
[3417,null,null,null,null,"","LA MARE AUX CHAMPS","VAUX"]
[3418,null,null,null,null,"","LA MARE AUX CHAMPS","VAUX"]
[3419,null,null,null,null,"","LA MARE AUX CHAMPS","VAUX"]
[3420,null,null,null,null,"","LA MARE AUX CHAMPS","VAUX"]
[3421,null,null,null,null,"","LA MARE AUX CHAMPS","VAUX"]
[3422,null,null,null,null,"","LA MARE AUX CHAMPS","VAUX"]
[3423,null,null,null,null,"","LA MARE AUX CHAMPS","VAUX"]
[3424,null,null,null,null,"","LA MARE AUX CHAMPS","VAUX"]
[3425,null,null,null,null,"","LA MARE AUX CHAMPS","VAUX"]
[3426,null,null,null,null,"","LA MARE AUX CHAMPS","VAUX"]
[3427,null,null,null,null,"","LA MARE AUX CHAMPS","VAUX"]
[3428,null,null,null,null,"","LA MARE AUX CHAMPS","VAUX"]
[3429,null,null,null,null,"","LA MARE AUX CHAMPS","VAUX"]
[3430,null,null,null,null,"","LA MARE AUX CHAMPS","VAUX"]
[3431,null,null,null,null,"","LA MARE AUX CHAMPS","VAUX"]
[3432,null,null,null,null,"","LA MARE AUX CHAMPS","VAUX"]
[3433,null,null,null,null,"","LA MARE AUX CHAMPS","VAUX"]
[3434,null,null,null,null,"","LA MARE AUX CHAMPS","VAUX"]
[3435,null,null,null,null,"","LA MARE AUX CHAMPS","VAUX"]
[3436,null,null,null,null,"","LA MARE AUX CHAMPS","VAUX"]
[3437,null,null,null,null,"","LA MARE AUX CHAMPS","VAUX"]
[3438,null,null,null,null,"","LA MARE AUX CHAMPS","VAUX"]
[3439,null,null,null,null,"","LA MARE AUX CHAMPS","VAUX"]
[3440,null,null,null,null,"","LA MARE AUX CHAMPS","VAUX"]
[3441,null,null,null,null,"","LA MARE AUX CHAMPS","VAUX"]
[3442,null,null,null,null,"","LA MARE AUX CHAMPS","VAUX"]
[3443,null,null,null,null,"","LA MARE AUX CHAMPS","VAUX"]
[3444,null,null,null,null,"","LA MARE AUX CHAMPS","VAUX"]
[3445,null,null,null,null,"","LA MARE AUX CHAMPS","VAUX"]
[3446,null,null,null,null,"","LA MARE AUX CHAMPS","VAUX"]
[3447,null,null,null,null,"","LA MARE AUX CHAMPS","VAUX"]
[3448,null,null,null,null,"","LA MARE AUX CHAMPS","VAUX"]
[3449,null,null,null,null,"","LA MARE AUX CHAMPS","VAUX"]
[3450,null,null,null,null,"","LA MARE AUX CHAMPS","VAUX"]
[3451,null,null,null,null,"","LA MARE AUX CHAMPS","VAUX"]
[3452,null,null,null,null,"","LA MARE AUX CHAMPS","VAUX"]
[3453,null,null,null,null,"","LA MARE AUX CHAMPS","VAUX"]
[3454,null,null,null,null,"","LA MARE AUX CHAMPS","VAUX"]
[3455,null,null,null,null,"","LA MARE AUX CHAMPS","VAUX"]
[3456,null,null,null,null,"","LA MARE AUX CHAMPS","VAUX"]
[3457,null,null,null,null,{"$f":"IF(D3458=\"\",\"\",IF(E3458=\"f\",LOOKUP(D3458,cat_unss,cat_f),LOOKUP(D3458,cat_unss,cat_g)))","v":""},"LA MARE AUX CHAMPS","VAUX"]
[3458,null,null,null,null,"","LA MARE AUX CHAMPS","VAUX"]
[3459,null,null,null,null,"","LA MARE AUX CHAMPS","VAUX"]
[3460,null,null,null,null,"","LA MARE AUX CHAMPS","VAUX"]
[3461,null,null,null,null,"","LA MARE AUX CHAMPS","VAUX"]
[3462,null,null,null,null,"","LA MARE AUX CHAMPS","VAUX"]
[3463,null,null,null,null,"","LA MARE AUX CHAMPS","VAUX"]
[3464,null,null,null,null,"","LA MARE AUX CHAMPS","VAUX"]
[3465,null,null,null,null,"","LA MARE AUX CHAMPS","VAUX"]
[3466,null,null,null,null,"","LA MARE AUX CHAMPS","VAUX"]
[3467,null,null,null,null,"","LA MARE AUX CHAMPS","VAUX"]
[3468,null,null,null,null,"","LA MARE AUX CHAMPS","VAUX"]
[3469,null,null,null,null,"","LA MARE AUX CHAMPS","VAUX"]
[3470,null,null,null,null,"","LA MARE AUX CHAMPS","VAUX"]
[3471,null,null,null,null,"","LA MARE AUX CHAMPS","VAUX"]
[3472,null,null,null,null,"","LA MARE AUX CHAMPS","VAUX"]
[3473,null,null,null,null,"","LA MARE AUX CHAMPS","VAUX"]
[3474,null,null,null,null,"","LA MARE AUX CHAMPS","VAUX"]
[3475,null,null,null,null,"","LA MARE AUX CHAMPS","VAUX"]
[3476,null,null,null,null,"","LA MARE AUX CHAMPS","VAUX"]
[3477,null,null,null,null,"","LA MARE AUX CHAMPS","VAUX"]
[3478,null,null,null,null,"","LA MARE AUX CHAMPS","VAUX"]
[3479,null,null,null,null,"","LA MARE AUX CHAMPS","VAUX"]
[3480,null,null,null,null,"","LA MARE AUX CHAMPS","VAUX"]
[3481,null,null,null,null,"","LA MARE AUX CHAMPS","VAUX"]
[3482,null,null,null,null,"","LA MARE AUX CHAMPS","VAUX"]
[3483,null,null,null,null,"","LA MARE AUX CHAMPS","VAUX"]
[3484,null,null,null,null,"","LA MARE AUX CHAMPS","VAUX"]
[3485,null,null,null,null,"","LA MARE AUX CHAMPS","VAUX"]
[3486,null,null,null,null,"","LA MARE AUX CHAMPS","VAUX"]
[3487,null,null,null,null,"","LA MARE AUX CHAMPS","VAUX"]
[3488,null,null,null,null,"","LA MARE AUX CHAMPS","VAUX"]
[3489,null,null,null,null,"","LA MARE AUX CHAMPS","VAUX"]
[3490,null,null,null,null,"","LA MARE AUX CHAMPS","VAUX"]
[3491,null,null,null,null,"","LA MARE AUX CHAMPS","VAUX"]
[3492,null,null,null,null,"","LA MARE AUX CHAMPS","VAUX"]
[3493,null,null,null,null,"","LA MARE AUX CHAMPS","VAUX"]
[3494,null,null,null,null,"","LA MARE AUX CHAMPS","VAUX"]
[3495,null,null,null,null,"","LA MARE AUX CHAMPS","VAUX"]
[3496,null,null,null,null,"","LA MARE AUX CHAMPS","VAUX"]
[3497,null,null,null,null,"","LA MARE AUX CHAMPS","VAUX"]
[3498,null,null,null,null,"","LA MARE AUX CHAMPS","VAUX"]
[3499,null,null,null,null,"","LA MARE AUX CHAMPS","VAUX"]
[3500,null,null,null,null,"","LA MARE AUX CHAMPS","VAUX"]
[3501,null,null,null,null,"","LA MARE AUX CHAMPS","VAUX"]
[3502,null,null,null,null,"","LA MARE AUX CHAMPS","VAUX"]
[3503,null,null,null,null,"","LA MARE AUX CHAMPS","VAUX"]
[3504,null,null,null,null,"","LA MARE AUX CHAMPS","VAUX"]
[3505,null,null,null,null,"","LA MARE AUX CHAMPS","VAUX"]
[3506,null,null,null,null,"","LA MARE AUX CHAMPS","VAUX"]
[3507,null,null,null,null,"","LA MARE AUX CHAMPS","VAUX"]
[3508,null,null,null,null,"","LA MARE AUX CHAMPS","VAUX"]
[3509,null,null,null,null,"","LA MARE AUX CHAMPS","VAUX"]
[3510,null,null,null,null,"","LA MARE AUX CHAMPS","VAUX"]
[3511,null,null,null,null,"","LA MARE AUX CHAMPS","VAUX"]
[3512,null,null,null,null,"","LA MARE AUX CHAMPS","VAUX"]
[3513,null,null,null,null,"","LA MARE AUX CHAMPS","VAUX"]
[3514,null,null,null,null,"","LA MARE AUX CHAMPS","VAUX"]
[3515,null,null,null,null,"","LA MARE AUX CHAMPS","VAUX"]
[3516,null,null,null,null,"","LA MARE AUX CHAMPS","VAUX"]
[3517,null,null,null,null,"","LA MARE AUX CHAMPS","VAUX"]
[3518,null,null,null,null,"","LA MARE AUX CHAMPS","VAUX"]
[3519,null,null,null,null,"","LA MARE AUX CHAMPS","VAUX"]
[3520,null,null,null,null,"","LA MARE AUX CHAMPS","VAUX"]
[3521,null,null,null,null,{"$f":"IF(D3522=\"\",\"\",IF(E3522=\"f\",LOOKUP(D3522,cat_unss,cat_f),LOOKUP(D3522,cat_unss,cat_g)))","v":""},"LA MARE AUX CHAMPS","VAUX"]
[3522,null,null,null,null,"","LA MARE AUX CHAMPS","VAUX"]
[3523,null,null,null,null,"","LA MARE AUX CHAMPS","VAUX"]
[3524,null,null,null,null,"","LA MARE AUX CHAMPS","VAUX"]
[3525,null,null,null,null,"","LA MARE AUX CHAMPS","VAUX"]
[3526,null,null,null,null,"","LA MARE AUX CHAMPS","VAUX"]
[3527,null,null,null,null,"","LA MARE AUX CHAMPS","VAUX"]
[3528,null,null,null,null,"","LA MARE AUX CHAMPS","VAUX"]
[3529,null,null,null,null,"","LA MARE AUX CHAMPS","VAUX"]
[3530,null,null,null,null,"","LA MARE AUX CHAMPS","VAUX"]
[3531,null,null,null,null,"","LA MARE AUX CHAMPS","VAUX"]
[3532,null,null,null,null,"","LA MARE AUX CHAMPS","VAUX"]
[3533,null,null,null,null,"","LA MARE AUX CHAMPS","VAUX"]
[3534,null,null,null,null,"","LA MARE AUX CHAMPS","VAUX"]
[3535,null,null,null,null,"","LA MARE AUX CHAMPS","VAUX"]
[3536,null,null,null,null,"","LA MARE AUX CHAMPS","VAUX"]
[3537,null,null,null,null,"","LA MARE AUX CHAMPS","VAUX"]
[3538,null,null,null,null,"","LA MARE AUX CHAMPS","VAUX"]
[3539,null,null,null,null,"","LA MARE AUX CHAMPS","VAUX"]
[3540,null,null,null,null,"","LA MARE AUX CHAMPS","VAUX"]
[3541,null,null,null,null,"","LA MARE AUX CHAMPS","VAUX"]
[3542,null,null,null,null,"","LA MARE AUX CHAMPS","VAUX"]
[3543,null,null,null,null,"","LA MARE AUX CHAMPS","VAUX"]
[3544,null,null,null,null,"","LA MARE AUX CHAMPS","VAUX"]
[3545,null,null,null,null,"","LA MARE AUX CHAMPS","VAUX"]
[3546,null,null,null,null,"","LA MARE AUX CHAMPS","VAUX"]
[3547,null,null,null,null,"","LA MARE AUX CHAMPS","VAUX"]
[3548,null,null,null,null,"","LA MARE AUX CHAMPS","VAUX"]
[3549,null,null,null,null,"","LA MARE AUX CHAMPS","VAUX"]
[3550,null,null,null,null,"","LA MARE AUX CHAMPS","VAUX"]
[3551,null,null,null,null,"","LA MARE AUX CHAMPS","VAUX"]
[3552,null,null,null,null,"","LA MARE AUX CHAMPS","VAUX"]
[3553,null,null,null,null,"","LA MARE AUX CHAMPS","VAUX"]
[3554,null,null,null,null,"","LA MARE AUX CHAMPS","VAUX"]
[3555,null,null,null,null,"","LA MARE AUX CHAMPS","VAUX"]
[3556,null,null,null,null,"","LA MARE AUX CHAMPS","VAUX"]
[3557,null,null,null,null,"","LA MARE AUX CHAMPS","VAUX"]
[3558,null,null,null,null,"","LA MARE AUX CHAMPS","VAUX"]
[3559,null,null,null,null,"","LA MARE AUX CHAMPS","VAUX"]
[3560,null,null,null,null,"","LA MARE AUX CHAMPS","VAUX"]
[3561,null,null,null,null,"","LA MARE AUX CHAMPS","VAUX"]
[3562,null,null,null,null,"","LA MARE AUX CHAMPS","VAUX"]
[3563,null,null,null,null,"","LA MARE AUX CHAMPS","VAUX"]
[3564,null,null,null,null,"","LA MARE AUX CHAMPS","VAUX"]
[3565,null,null,null,null,"","LA MARE AUX CHAMPS","VAUX"]
[3566,null,null,null,null,"","LA MARE AUX CHAMPS","VAUX"]
[3567,null,null,null,null,"","LA MARE AUX CHAMPS","VAUX"]
[3568,null,null,null,null,"","LA MARE AUX CHAMPS","VAUX"]
[3569,null,null,null,null,"","LA MARE AUX CHAMPS","VAUX"]
[3570,null,null,null,null,"","LA MARE AUX CHAMPS","VAUX"]
[3571,null,null,null,null,"","LA MARE AUX CHAMPS","VAUX"]
[3572,null,null,null,null,"","LA MARE AUX CHAMPS","VAUX"]
[3573,null,null,null,null,"","LA MARE AUX CHAMPS","VAUX"]
[3574,null,null,null,null,"","LA MARE AUX CHAMPS","VAUX"]
[3575,null,null,null,null,"","LA MARE AUX CHAMPS","VAUX"]
[3576,null,null,null,null,"","LA MARE AUX CHAMPS","VAUX"]
[3577,null,null,null,null,"","LA MARE AUX CHAMPS","VAUX"]
[3578,null,null,null,null,"","LA MARE AUX CHAMPS","VAUX"]
[3579,null,null,null,null,"","LA MARE AUX CHAMPS","VAUX"]
[3580,null,null,null,null,"","LA MARE AUX CHAMPS","VAUX"]
[3581,null,null,null,null,"","LA MARE AUX CHAMPS","VAUX"]
[3582,null,null,null,null,"","LA MARE AUX CHAMPS","VAUX"]
[3583,null,null,null,null,"","LA MARE AUX CHAMPS","VAUX"]
[3584,null,null,null,null,"","LA MARE AUX CHAMPS","VAUX"]
[3585,null,null,null,null,{"$f":"IF(D3586=\"\",\"\",IF(E3586=\"f\",LOOKUP(D3586,cat_unss,cat_f),LOOKUP(D3586,cat_unss,cat_g)))","v":""},"LA MARE AUX CHAMPS","VAUX"]
[3586,null,null,null,null,"","LA MARE AUX CHAMPS","VAUX"]
[3587,null,null,null,null,"","LA MARE AUX CHAMPS","VAUX"]
[3588,null,null,null,null,"","LA MARE AUX CHAMPS","VAUX"]
[3589,null,null,null,null,"","LA MARE AUX CHAMPS","VAUX"]
[3590,null,null,null,null,"","LA MARE AUX CHAMPS","VAUX"]
[3591,null,null,null,null,"","LA MARE AUX CHAMPS","VAUX"]
[3592,null,null,null,null,"","LA MARE AUX CHAMPS","VAUX"]
[3593,null,null,null,null,"","LA MARE AUX CHAMPS","VAUX"]
[3594,null,null,null,null,"","LA MARE AUX CHAMPS","VAUX"]
[3595,null,null,null,null,"","LA MARE AUX CHAMPS","VAUX"]
[3596,null,null,null,null,"","LA MARE AUX CHAMPS","VAUX"]
[3597,null,null,null,null,"","LA MARE AUX CHAMPS","VAUX"]
[3598,null,null,null,null,"","LA MARE AUX CHAMPS","VAUX"]
[3599,null,null,null,null,"","LA MARE AUX CHAMPS","VAUX"]
[3600,null,null,null,null,"","LA MARE AUX CHAMPS","VAUX"]
[3601,"HUEZ","Sacha",2002,"G","MG","NAZARETH","VOISENON"]
[3602,"OULED BOUARIF","Hassan",2003,"G","MG","NAZARETH","VOISENON"]
[3603,"SURENA","Louis",2005,"G","BG1","NAZARETH","VOISENON"]
[3604,"BRULE","Titouan",2005,"G","BG1","NAZARETH","VOISENON"]
[3605,"DO NASCIMENTO","Pablo",2005,"G","BG1","NAZARETH","VOISENON"]
[3606,"PENNEC","Solenn",2005,"F","BF1","NAZARETH","VOISENON"]
[3607,"DERCY","Maëlle",2004,"F","BF2","NAZARETH","VOISENON"]
[3608,"LEBOUAZOLA","Yanis",2005,"G","BG1","NAZARETH","VOISENON"]
[3609,"VANNIER","Baptiste",2003,"G","MG","NAZARETH","VOISENON"]
[3610,"LANDRY","Alizée",2002,"F","MF","NAZARETH","VOISENON"]
[3611,"BILLIET","Baptiste",2005,"G","BG1","NAZARETH","VOISENON"]
[3612,"PAROLARI","Quentin",2005,"G","BG1","NAZARETH","VOISENON"]
[3613,"AÏT-MOHAND","Wissal",2005,"F","BF1","NAZARETH","VOISENON"]
[3614,"DELEFORTERIE","Doreen",2005,"F","BF1","NAZARETH","VOISENON"]
[3615,"PILSA","Charlène",2003,"F","MF","NAZARETH","VOISENON"]
[3616,"BOUEDO","Florian",2005,"G","BG1","NAZARETH","VOISENON"]
[3617,"KADDOURI","Wassim",2005,"G","BG1","NAZARETH","VOISENON"]
[3618,"DE ARAUJO","Maëlys",2003,"F","MF","NAZARETH","VOISENON"]
[3619,"BOUEDO","Annaelle",2003,"F","MF","NAZARETH","VOISENON"]
[3620,"ROGER","Florent",2003,"G","MG","NAZARETH","VOISENON"]
[3621,"PICOT","Loane",2004,"F","BF2","NAZARETH","VOISENON"]
[3622,"TESTE","Alexis",2003,"G","MG","NAZARETH","VOISENON"]
[3623,null,null,null,null,"","NAZARETH","VOISENON"]
[3624,null,null,null,null,"","NAZARETH","VOISENON"]
[3625,null,null,null,null,"","NAZARETH","VOISENON"]
[3626,null,null,null,null,"","NAZARETH","VOISENON"]
[3627,null,null,null,null,"","NAZARETH","VOISENON"]
[3628,null,null,null,null,"","NAZARETH","VOISENON"]
[3629,null,null,null,null,"","NAZARETH","VOISENON"]
[3630,null,null,null,null,"","NAZARETH","VOISENON"]
[3631,null,null,null,null,"","NAZARETH","VOISENON"]
[3632,null,null,null,null,"","NAZARETH","VOISENON"]
[3633,null,null,null,null,"","NAZARETH","VOISENON"]
[3634,null,null,null,null,"","NAZARETH","VOISENON"]
[3635,null,null,null,null,"","NAZARETH","VOISENON"]
[3636,null,null,null,null,"","NAZARETH","VOISENON"]
[3637,null,null,null,null,"","NAZARETH","VOISENON"]
[3638,null,null,null,null,"","NAZARETH","VOISENON"]
[3639,null,null,null,null,"","NAZARETH","VOISENON"]
[3640,null,null,null,null,"","NAZARETH","VOISENON"]
[3641,null,null,null,null,"","NAZARETH","VOISENON"]
[3642,null,null,null,null,"","NAZARETH","VOISENON"]
[3643,null,null,null,null,"","NAZARETH","VOISENON"]
[3644,null,null,null,null,"","NAZARETH","VOISENON"]
[3645,null,null,null,null,"","NAZARETH","VOISENON"]
[3646,null,null,null,null,"","NAZARETH","VOISENON"]
[3647,null,null,null,null,"","NAZARETH","VOISENON"]
[3648,null,null,null,null,"","NAZARETH","VOISENON"]
[3649,null,null,null,null,{"$f":"IF(D3650=\"\",\"\",IF(E3650=\"f\",LOOKUP(D3650,cat_unss,cat_f),LOOKUP(D3650,cat_unss,cat_g)))","v":""},"NAZARETH","VOISENON"]
[3650,null,null,null,null,"","NAZARETH","VOISENON"]
[3651,null,null,null,null,"","NAZARETH","VOISENON"]
[3652,null,null,null,null,"","NAZARETH","VOISENON"]
[3653,null,null,null,null,"","NAZARETH","VOISENON"]
[3654,null,null,null,null,"","NAZARETH","VOISENON"]
[3655,null,null,null,null,"","NAZARETH","VOISENON"]
[3656,null,null,null,null,"","NAZARETH","VOISENON"]
[3657,null,null,null,null,"","NAZARETH","VOISENON"]
[3658,null,null,null,null,"","NAZARETH","VOISENON"]
[3659,null,null,null,null,"","NAZARETH","VOISENON"]
[3660,null,null,null,null,"","NAZARETH","VOISENON"]
[3661,null,null,null,null,"","NAZARETH","VOISENON"]
[3662,null,null,null,null,"","NAZARETH","VOISENON"]
[3663,null,null,null,null,"","NAZARETH","VOISENON"]
[3664,null,null,null,null,"","NAZARETH","VOISENON"]
[3665,null,null,null,null,"","NAZARETH","VOISENON"]
[3666,null,null,null,null,"","NAZARETH","VOISENON"]
[3667,null,null,null,null,"","NAZARETH","VOISENON"]
[3668,null,null,null,null,"","NAZARETH","VOISENON"]
[3669,null,null,null,null,"","NAZARETH","VOISENON"]
[3670,null,null,null,null,"","NAZARETH","VOISENON"]
[3671,null,null,null,null,"","NAZARETH","VOISENON"]
[3672,null,null,null,null,"","NAZARETH","VOISENON"]
[3673,null,null,null,null,"","NAZARETH","VOISENON"]
[3674,null,null,null,null,"","NAZARETH","VOISENON"]
[3675,null,null,null,null,"","NAZARETH","VOISENON"]
[3676,null,null,null,null,"","NAZARETH","VOISENON"]
[3677,null,null,null,null,"","NAZARETH","VOISENON"]
[3678,null,null,null,null,"","NAZARETH","VOISENON"]
[3679,null,null,null,null,"","NAZARETH","VOISENON"]
[3680,null,null,null,null,"","NAZARETH","VOISENON"]
[3681,null,null,null,null,"","NAZARETH","VOISENON"]
[3682,null,null,null,null,"","NAZARETH","VOISENON"]
[3683,null,null,null,null,"","NAZARETH","VOISENON"]
[3684,null,null,null,null,"","NAZARETH","VOISENON"]
[3685,null,null,null,null,"","NAZARETH","VOISENON"]
[3686,null,null,null,null,"","NAZARETH","VOISENON"]
[3687,null,null,null,null,"","NAZARETH","VOISENON"]
[3688,null,null,null,null,"","NAZARETH","VOISENON"]
[3689,null,null,null,null,"","NAZARETH","VOISENON"]
[3690,null,null,null,null,"","NAZARETH","VOISENON"]
[3691,null,null,null,null,"","NAZARETH","VOISENON"]
[3692,null,null,null,null,"","NAZARETH","VOISENON"]
[3693,null,null,null,null,"","NAZARETH","VOISENON"]
[3694,null,null,null,null,"","NAZARETH","VOISENON"]
[3695,null,null,null,null,"","NAZARETH","VOISENON"]
[3696,null,null,null,null,"","NAZARETH","VOISENON"]
[3697,null,null,null,null,"","NAZARETH","VOISENON"]
[3698,null,null,null,null,"","NAZARETH","VOISENON"]
[3699,null,null,null,null,"","NAZARETH","VOISENON"]
[3700,null,null,null,null,"","NAZARETH","VOISENON"]
[3701,null,null,null,null,"","NAZARETH","VOISENON"]
[3702,null,null,null,null,"","NAZARETH","VOISENON"]
[3703,null,null,null,null,"","NAZARETH","VOISENON"]
[3704,null,null,null,null,"","NAZARETH","VOISENON"]
[3705,null,null,null,null,"","NAZARETH","VOISENON"]
[3706,null,null,null,null,"","NAZARETH","VOISENON"]
[3707,null,null,null,null,"","NAZARETH","VOISENON"]
[3708,null,null,null,null,"","NAZARETH","VOISENON"]
[3709,null,null,null,null,"","NAZARETH","VOISENON"]
[3710,null,null,null,null,"","NAZARETH","VOISENON"]
[3711,null,null,null,null,"","NAZARETH","VOISENON"]
[3712,null,null,null,null,"","NAZARETH","VOISENON"]
[3713,null,null,null,null,{"$f":"IF(D3714=\"\",\"\",IF(E3714=\"f\",LOOKUP(D3714,cat_unss,cat_f),LOOKUP(D3714,cat_unss,cat_g)))","v":""},"NAZARETH","VOISENON"]
[3714,null,null,null,null,"","NAZARETH","VOISENON"]
[3715,null,null,null,null,"","NAZARETH","VOISENON"]
[3716,null,null,null,null,"","NAZARETH","VOISENON"]
[3717,null,null,null,null,"","NAZARETH","VOISENON"]
[3718,null,null,null,null,"","NAZARETH","VOISENON"]
[3719,null,null,null,null,"","NAZARETH","VOISENON"]
[3720,null,null,null,null,"","NAZARETH","VOISENON"]
[3721,null,null,null,null,"","NAZARETH","VOISENON"]
[3722,null,null,null,null,"","NAZARETH","VOISENON"]
[3723,null,null,null,null,"","NAZARETH","VOISENON"]
[3724,null,null,null,null,"","NAZARETH","VOISENON"]
[3725,null,null,null,null,"","NAZARETH","VOISENON"]
[3726,null,null,null,null,"","NAZARETH","VOISENON"]
[3727,null,null,null,null,"","NAZARETH","VOISENON"]
[3728,null,null,null,null,"","NAZARETH","VOISENON"]
[3729,null,null,null,null,"","NAZARETH","VOISENON"]
[3730,null,null,null,null,"","NAZARETH","VOISENON"]
[3731,null,null,null,null,"","NAZARETH","VOISENON"]
[3732,null,null,null,null,"","NAZARETH","VOISENON"]
[3733,null,null,null,null,"","NAZARETH","VOISENON"]
[3734,null,null,null,null,"","NAZARETH","VOISENON"]
[3735,null,null,null,null,"","NAZARETH","VOISENON"]
[3736,null,null,null,null,"","NAZARETH","VOISENON"]
[3737,null,null,null,null,"","NAZARETH","VOISENON"]
[3738,null,null,null,null,"","NAZARETH","VOISENON"]
[3739,null,null,null,null,"","NAZARETH","VOISENON"]
[3740,null,null,null,null,"","NAZARETH","VOISENON"]
[3741,null,null,null,null,"","NAZARETH","VOISENON"]
[3742,null,null,null,null,"","NAZARETH","VOISENON"]
[3743,null,null,null,null,"","NAZARETH","VOISENON"]
[3744,null,null,null,null,"","NAZARETH","VOISENON"]
[3745,null,null,null,null,"","NAZARETH","VOISENON"]
[3746,null,null,null,null,"","NAZARETH","VOISENON"]
[3747,null,null,null,null,"","NAZARETH","VOISENON"]
[3748,null,null,null,null,"","NAZARETH","VOISENON"]
[3749,null,null,null,null,"","NAZARETH","VOISENON"]
[3750,null,null,null,null,"","NAZARETH","VOISENON"]
[3751,null,null,null,null,"","NAZARETH","VOISENON"]
[3752,null,null,null,null,"","NAZARETH","VOISENON"]
[3753,null,null,null,null,"","NAZARETH","VOISENON"]
[3754,null,null,null,null,"","NAZARETH","VOISENON"]
[3755,null,null,null,null,"","NAZARETH","VOISENON"]
[3756,null,null,null,null,"","NAZARETH","VOISENON"]
[3757,null,null,null,null,"","NAZARETH","VOISENON"]
[3758,null,null,null,null,"","NAZARETH","VOISENON"]
[3759,null,null,null,null,"","NAZARETH","VOISENON"]
[3760,null,null,null,null,"","NAZARETH","VOISENON"]
[3761,null,null,null,null,"","NAZARETH","VOISENON"]
[3762,null,null,null,null,"","NAZARETH","VOISENON"]
[3763,null,null,null,null,"","NAZARETH","VOISENON"]
[3764,null,null,null,null,"","NAZARETH","VOISENON"]
[3765,null,null,null,null,"","NAZARETH","VOISENON"]
[3766,null,null,null,null,"","NAZARETH","VOISENON"]
[3767,null,null,null,null,"","NAZARETH","VOISENON"]
[3768,null,null,null,null,"","NAZARETH","VOISENON"]
[3769,null,null,null,null,"","NAZARETH","VOISENON"]
[3770,null,null,null,null,"","NAZARETH","VOISENON"]
[3771,null,null,null,null,"","NAZARETH","VOISENON"]
[3772,null,null,null,null,"","NAZARETH","VOISENON"]
[3773,null,null,null,null,"","NAZARETH","VOISENON"]
[3774,null,null,null,null,"","NAZARETH","VOISENON"]
[3775,null,null,null,null,"","NAZARETH","VOISENON"]
[3776,null,null,null,null,"","NAZARETH","VOISENON"]
[3777,null,null,null,null,{"$f":"IF(D3778=\"\",\"\",IF(E3778=\"f\",LOOKUP(D3778,cat_unss,cat_f),LOOKUP(D3778,cat_unss,cat_g)))","v":""},"NAZARETH","VOISENON"]
[3778,null,null,null,null,"","NAZARETH","VOISENON"]
[3779,null,null,null,null,"","NAZARETH","VOISENON"]
[3780,null,null,null,null,"","NAZARETH","VOISENON"]
[3781,null,null,null,null,"","NAZARETH","VOISENON"]
[3782,null,null,null,null,"","NAZARETH","VOISENON"]
[3783,null,null,null,null,"","NAZARETH","VOISENON"]
[3784,null,null,null,null,"","NAZARETH","VOISENON"]
[3785,null,null,null,null,"","NAZARETH","VOISENON"]
[3786,null,null,null,null,"","NAZARETH","VOISENON"]
[3787,null,null,null,null,"","NAZARETH","VOISENON"]
[3788,null,null,null,null,"","NAZARETH","VOISENON"]
[3789,null,null,null,null,"","NAZARETH","VOISENON"]
[3790,null,null,null,null,"","NAZARETH","VOISENON"]
[3791,null,null,null,null,"","NAZARETH","VOISENON"]
[3792,null,null,null,null,"","NAZARETH","VOISENON"]
[3793,null,null,null,null,"","NAZARETH","VOISENON"]
[3794,null,null,null,null,"","NAZARETH","VOISENON"]
[3795,null,null,null,null,"","NAZARETH","VOISENON"]
[3796,null,null,null,null,"","NAZARETH","VOISENON"]
[3797,null,null,null,null,"","NAZARETH","VOISENON"]
[3798,null,null,null,null,"","NAZARETH","VOISENON"]
[3799,null,null,null,null,"","NAZARETH","VOISENON"]
[3800,null,null,null,null,"","NAZARETH","VOISENON"]
[3801,null,null,null,null,"","NAZARETH","VOISENON"]
[3802,null,null,null,null,"","NAZARETH","VOISENON"]
[3803,null,null,null,null,"","NAZARETH","VOISENON"]
[3804,null,null,null,null,"","NAZARETH","VOISENON"]
[3805,null,null,null,null,"","NAZARETH","VOISENON"]
[3806,null,null,null,null,"","NAZARETH","VOISENON"]
[3807,null,null,null,null,"","NAZARETH","VOISENON"]
[3808,null,null,null,null,"","NAZARETH","VOISENON"]
[3809,null,null,null,null,"","NAZARETH","VOISENON"]
[3810,null,null,null,null,"","NAZARETH","VOISENON"]
[3811,null,null,null,null,"","NAZARETH","VOISENON"]
[3812,null,null,null,null,"","NAZARETH","VOISENON"]
[3813,null,null,null,null,"","NAZARETH","VOISENON"]
[3814,null,null,null,null,"","NAZARETH","VOISENON"]
[3815,null,null,null,null,"","NAZARETH","VOISENON"]
[3816,null,null,null,null,"","NAZARETH","VOISENON"]
[3817,null,null,null,null,"","NAZARETH","VOISENON"]
[3818,null,null,null,null,"","NAZARETH","VOISENON"]
[3819,null,null,null,null,"","NAZARETH","VOISENON"]
[3820,null,null,null,null,"","NAZARETH","VOISENON"]
[3821,null,null,null,null,"","NAZARETH","VOISENON"]
[3822,null,null,null,null,"","NAZARETH","VOISENON"]
[3823,null,null,null,null,"","NAZARETH","VOISENON"]
[3824,null,null,null,null,"","NAZARETH","VOISENON"]
[3825,null,null,null,null,"","NAZARETH","VOISENON"]
[3826,null,null,null,null,"","NAZARETH","VOISENON"]
[3827,null,null,null,null,"","NAZARETH","VOISENON"]
[3828,null,null,null,null,"","NAZARETH","VOISENON"]
[3829,null,null,null,null,"","NAZARETH","VOISENON"]
[3830,null,null,null,null,"","NAZARETH","VOISENON"]
[3831,null,null,null,null,"","NAZARETH","VOISENON"]
[3832,null,null,null,null,"","NAZARETH","VOISENON"]
[3833,null,null,null,null,"","NAZARETH","VOISENON"]
[3834,null,null,null,null,"","NAZARETH","VOISENON"]
[3835,null,null,null,null,"","NAZARETH","VOISENON"]
[3836,null,null,null,null,"","NAZARETH","VOISENON"]
[3837,null,null,null,null,"","NAZARETH","VOISENON"]
[3838,null,null,null,null,"","NAZARETH","VOISENON"]
[3839,null,null,null,null,"","NAZARETH","VOISENON"]
[3840,null,null,null,null,"","NAZARETH","VOISENON"]
[3841,null,null,null,null,{"$f":"IF(D3842=\"\",\"\",IF(E3842=\"f\",LOOKUP(D3842,cat_unss,cat_f),LOOKUP(D3842,cat_unss,cat_g)))","v":""},"NAZARETH","VOISENON"]
[3842,null,null,null,null,"","NAZARETH","VOISENON"]
[3843,null,null,null,null,"","NAZARETH","VOISENON"]
[3844,null,null,null,null,"","NAZARETH","VOISENON"]
[3845,null,null,null,null,"","NAZARETH","VOISENON"]
[3846,null,null,null,null,"","NAZARETH","VOISENON"]
[3847,null,null,null,null,"","NAZARETH","VOISENON"]
[3848,null,null,null,null,"","NAZARETH","VOISENON"]
[3849,null,null,null,null,"","NAZARETH","VOISENON"]
[3850,null,null,null,null,"","NAZARETH","VOISENON"]
[3851,null,null,null,null,"","NAZARETH","VOISENON"]
[3852,null,null,null,null,"","NAZARETH","VOISENON"]
[3853,null,null,null,null,"","NAZARETH","VOISENON"]
[3854,null,null,null,null,"","NAZARETH","VOISENON"]
[3855,null,null,null,null,"","NAZARETH","VOISENON"]
[3856,null,null,null,null,"","NAZARETH","VOISENON"]
[3857,null,null,null,null,"","NAZARETH","VOISENON"]
[3858,null,null,null,null,"","NAZARETH","VOISENON"]
[3859,null,null,null,null,"","NAZARETH","VOISENON"]
[3860,null,null,null,null,"","NAZARETH","VOISENON"]
[3861,null,null,null,null,"","NAZARETH","VOISENON"]
[3862,null,null,null,null,"","NAZARETH","VOISENON"]
[3863,null,null,null,null,"","NAZARETH","VOISENON"]
[3864,null,null,null,null,"","NAZARETH","VOISENON"]
[3865,null,null,null,null,"","NAZARETH","VOISENON"]
[3866,null,null,null,null,"","NAZARETH","VOISENON"]
[3867,null,null,null,null,"","NAZARETH","VOISENON"]
[3868,null,null,null,null,"","NAZARETH","VOISENON"]
[3869,null,null,null,null,"","NAZARETH","VOISENON"]
[3870,null,null,null,null,"","NAZARETH","VOISENON"]
[3871,null,null,null,null,"","NAZARETH","VOISENON"]
[3872,null,null,null,null,"","NAZARETH","VOISENON"]
[3873,null,null,null,null,"","NAZARETH","VOISENON"]
[3874,null,null,null,null,"","NAZARETH","VOISENON"]
[3875,null,null,null,null,"","NAZARETH","VOISENON"]
[3876,null,null,null,null,"","NAZARETH","VOISENON"]
[3877,null,null,null,null,"","NAZARETH","VOISENON"]
[3878,null,null,null,null,"","NAZARETH","VOISENON"]
[3879,null,null,null,null,"","NAZARETH","VOISENON"]
[3880,null,null,null,null,"","NAZARETH","VOISENON"]
[3881,null,null,null,null,"","NAZARETH","VOISENON"]
[3882,null,null,null,null,"","NAZARETH","VOISENON"]
[3883,null,null,null,null,"","NAZARETH","VOISENON"]
[3884,null,null,null,null,"","NAZARETH","VOISENON"]
[3885,null,null,null,null,"","NAZARETH","VOISENON"]
[3886,null,null,null,null,"","NAZARETH","VOISENON"]
[3887,null,null,null,null,"","NAZARETH","VOISENON"]
[3888,null,null,null,null,"","NAZARETH","VOISENON"]
[3889,null,null,null,null,"","NAZARETH","VOISENON"]
[3890,null,null,null,null,"","NAZARETH","VOISENON"]
[3891,null,null,null,null,"","NAZARETH","VOISENON"]
[3892,null,null,null,null,"","NAZARETH","VOISENON"]
[3893,null,null,null,null,"","NAZARETH","VOISENON"]
[3894,null,null,null,null,"","NAZARETH","VOISENON"]
[3895,null,null,null,null,"","NAZARETH","VOISENON"]
[3896,null,null,null,null,"","NAZARETH","VOISENON"]
[3897,null,null,null,null,"","NAZARETH","VOISENON"]
[3898,null,null,null,null,"","NAZARETH","VOISENON"]
[3899,null,null,null,null,"","NAZARETH","VOISENON"]
[3900,null,null,null,null,"","NAZARETH","VOISENON"]
[3901,"LABOUDIE","Amel",2005,"F","BF1","R BONHEUR","LE CHATELET"]
[3902,"KUENTZ","Léna",2005,"F","BF1","R BONHEUR","LE CHATELET"]
[3903,"MINEIRO","Mathilde",2005,"F","BF1","R BONHEUR","LE CHATELET"]
[3904,"TASSERY","Juliette",2005,"F","BF1","R BONHEUR","LE CHATELET"]
[3905,"PACCHIANA ","Louis",2005,"G",{"$f":"IF(D3906=\"\",\"\",IF(E3906=\"f\",LOOKUP(D3906,cat_unss,cat_f),LOOKUP(D3906,cat_unss,cat_g)))","v":"BG1"},"R BONHEUR","LE CHATELET"]
[3906,"VIGNEAU","Erwan",2005,"G","BG1","R BONHEUR","LE CHATELET"]
[3907,"GABRIEL","Allan",2005,"G","BG1","R BONHEUR","LE CHATELET"]
[3908,"PEREIRA CARVALHO","Anaïs",2004,"F","BF2","R BONHEUR","LE CHATELET"]
[3909,"GREFFE","Léa",2004,"F","BF2","R BONHEUR","LE CHATELET"]
[3910,"SARREY","Anaïs",2004,"F","BF2","R BONHEUR","LE CHATELET"]
[3911,"BOMBAY KOY","Jason",2004,"G","BG2","R BONHEUR","LE CHATELET"]
[3912,"DUVERGT","Rémy",2004,"G","BG2","R BONHEUR","LE CHATELET"]
[3913,"AMBATE","Chris",2004,"G","BG2","R BONHEUR","LE CHATELET"]
[3914,"MASCARIN","Olivia",2003,"F","MF","R BONHEUR","LE CHATELET"]
[3915,"BOURGAULT","Marie",2004,"F","BF2","R BONHEUR","LE CHATELET"]
[3916,"LE SAUX","Mathilde",2003,"F","MF","R BONHEUR","LE CHATELET"]
[3917,"GAIGNON","Léna",2003,"F","MF","R BONHEUR","LE CHATELET"]
[3918,"BOMBAY KOY","Anthony",2003,"G","MG","R BONHEUR","LE CHATELET"]
[3919,"COUDRET","Jordan",2003,"G","MG","R BONHEUR","LE CHATELET"]
[3920,"HAUSE","Solenn",2002,"F","MF","R BONHEUR","LE CHATELET"]
[3921,"PATERNI","Emma",2002,"F","MF","R BONHEUR","LE CHATELET"]
[3922,"BRION","Cassandra",2002,"F","MF","R BONHEUR","LE CHATELET"]
[3923,"HOARAU","Maëva",2002,"F","MF","R BONHEUR","LE CHATELET"]
[3924,"PRAVET","Lilou",2002,"F","MF","R BONHEUR","LE CHATELET"]
[3925,"CHEVILLOT ","Gwladys",2002,"F","MF","R BONHEUR","LE CHATELET"]
[3926,"ALLART","Justin",2002,"G","MG","R BONHEUR","LE CHATELET"]
[3927,"LE LAY","Martin",2002,"G","MG","R BONHEUR","LE CHATELET"]
[3928,"DORE","JASON",2005,null,"BG1","R BONHEUR","LE CHATELET"]
[3929,"HURTEAU","MAXIME",2004,null,"BG2","R BONHEUR","LE CHATELET"]
[3930,"COURBET","LUCIE",2002,"F","MF","R BONHEUR","LE CHATELET"]
[3931,null,null,null,null,"","R BONHEUR","LE CHATELET"]
[3932,null,null,null,null,"","R BONHEUR","LE CHATELET"]
[3933,null,null,null,null,"","R BONHEUR","LE CHATELET"]
[3934,null,null,null,null,"","R BONHEUR","LE CHATELET"]
[3935,"RELOUZAT","CANDICE",2004,"F","BF2","R BONHEUR","LE CHATELET"]
[3936,null,null,null,null,"","R BONHEUR","LE CHATELET"]
[3937,null,null,null,null,"","R BONHEUR","LE CHATELET"]
[3938,null,null,null,null,"","R BONHEUR","LE CHATELET"]
[3939,null,null,null,null,"","R BONHEUR","LE CHATELET"]
[3940,null,null,null,null,"","R BONHEUR","LE CHATELET"]
[3941,null,null,null,null,"","R BONHEUR","LE CHATELET"]
[3942,null,null,null,null,"","R BONHEUR","LE CHATELET"]
[3943,null,null,null,null,"","R BONHEUR","LE CHATELET"]
[3944,null,null,null,null,"","R BONHEUR","LE CHATELET"]
[3945,null,null,null,null,"","R BONHEUR","LE CHATELET"]
[3946,null,null,null,null,"","R BONHEUR","LE CHATELET"]
[3947,null,null,null,null,"","R BONHEUR","LE CHATELET"]
[3948,null,null,null,null,"","R BONHEUR","LE CHATELET"]
[3949,null,null,null,null,"","R BONHEUR","LE CHATELET"]
[3950,null,null,null,null,"","R BONHEUR","LE CHATELET"]
[3951,null,null,null,null,"","R BONHEUR","LE CHATELET"]
[3952,null,null,null,null,"","R BONHEUR","LE CHATELET"]
[3953,null,null,null,null,"","R BONHEUR","LE CHATELET"]
[3954,null,null,null,null,"","R BONHEUR","LE CHATELET"]
[3955,null,null,null,null,"","R BONHEUR","LE CHATELET"]
[3956,null,null,null,null,"","R BONHEUR","LE CHATELET"]
[3957,null,null,null,null,"","R BONHEUR","LE CHATELET"]
[3958,null,null,null,null,"","R BONHEUR","LE CHATELET"]
[3959,null,null,null,null,"","R BONHEUR","LE CHATELET"]
[3960,null,null,null,null,"","R BONHEUR","LE CHATELET"]
[3961,null,null,null,null,"","R BONHEUR","LE CHATELET"]
[3962,null,null,null,null,"","R BONHEUR","LE CHATELET"]
[3963,null,null,null,null,"","R BONHEUR","LE CHATELET"]
[3964,null,null,null,null,"","R BONHEUR","LE CHATELET"]
[3965,null,null,null,null,"","R BONHEUR","LE CHATELET"]
[3966,null,null,null,null,"","R BONHEUR","LE CHATELET"]
[3967,null,null,null,null,"","R BONHEUR","LE CHATELET"]
[3968,null,null,null,null,"","R BONHEUR","LE CHATELET"]
[3969,null,null,null,null,{"$f":"IF(D3970=\"\",\"\",IF(E3970=\"f\",LOOKUP(D3970,cat_unss,cat_f),LOOKUP(D3970,cat_unss,cat_g)))","v":""},"R BONHEUR","LE CHATELET"]
[3970,null,null,null,null,"","R BONHEUR","LE CHATELET"]
[3971,null,null,null,null,"","R BONHEUR","LE CHATELET"]
[3972,null,null,null,null,"","R BONHEUR","LE CHATELET"]
[3973,null,null,null,null,"","R BONHEUR","LE CHATELET"]
[3974,null,null,null,null,"","R BONHEUR","LE CHATELET"]
[3975,null,null,null,null,"","R BONHEUR","LE CHATELET"]
[3976,null,null,null,null,"","R BONHEUR","LE CHATELET"]
[3977,null,null,null,null,"","R BONHEUR","LE CHATELET"]
[3978,null,null,null,null,"","R BONHEUR","LE CHATELET"]
[3979,null,null,null,null,"","R BONHEUR","LE CHATELET"]
[3980,null,null,null,null,"","R BONHEUR","LE CHATELET"]
[3981,null,null,null,null,"","R BONHEUR","LE CHATELET"]
[3982,null,null,null,null,"","R BONHEUR","LE CHATELET"]
[3983,null,null,null,null,"","R BONHEUR","LE CHATELET"]
[3984,null,null,null,null,"","R BONHEUR","LE CHATELET"]
[3985,null,null,null,null,"","R BONHEUR","LE CHATELET"]
[3986,null,null,null,null,"","R BONHEUR","LE CHATELET"]
[3987,null,null,null,null,"","R BONHEUR","LE CHATELET"]
[3988,null,null,null,null,"","R BONHEUR","LE CHATELET"]
[3989,null,null,null,null,"","R BONHEUR","LE CHATELET"]
[3990,null,null,null,null,"","R BONHEUR","LE CHATELET"]
[3991,null,null,null,null,"","R BONHEUR","LE CHATELET"]
[3992,null,null,null,null,"","R BONHEUR","LE CHATELET"]
[3993,null,null,null,null,"","R BONHEUR","LE CHATELET"]
[3994,null,null,null,null,"","R BONHEUR","LE CHATELET"]
[3995,null,null,null,null,"","R BONHEUR","LE CHATELET"]
[3996,null,null,null,null,"","R BONHEUR","LE CHATELET"]
[3997,null,null,null,null,"","R BONHEUR","LE CHATELET"]
[3998,null,null,null,null,"","R BONHEUR","LE CHATELET"]
[3999,null,null,null,null,"","R BONHEUR","LE CHATELET"]
[4000,null,null,null,null,"","R BONHEUR","LE CHATELET"]
[4001,null,null,null,null,"","R BONHEUR","LE CHATELET"]
[4002,null,null,null,null,"","R BONHEUR","LE CHATELET"]
[4003,null,null,null,null,"","R BONHEUR","LE CHATELET"]
[4004,null,null,null,null,"","R BONHEUR","LE CHATELET"]
[4005,null,null,null,null,"","R BONHEUR","LE CHATELET"]
[4006,null,null,null,null,"","R BONHEUR","LE CHATELET"]
[4007,null,null,null,null,"","R BONHEUR","LE CHATELET"]
[4008,null,null,null,null,"","R BONHEUR","LE CHATELET"]
[4009,null,null,null,null,"","R BONHEUR","LE CHATELET"]
[4010,null,null,null,null,"","R BONHEUR","LE CHATELET"]
[4011,null,null,null,null,"","R BONHEUR","LE CHATELET"]
[4012,null,null,null,null,"","R BONHEUR","LE CHATELET"]
[4013,null,null,null,null,"","R BONHEUR","LE CHATELET"]
[4014,null,null,null,null,"","R BONHEUR","LE CHATELET"]
[4015,null,null,null,null,"","R BONHEUR","LE CHATELET"]
[4016,null,null,null,null,"","R BONHEUR","LE CHATELET"]
[4017,null,null,null,null,"","R BONHEUR","LE CHATELET"]
[4018,null,null,null,null,"","R BONHEUR","LE CHATELET"]
[4019,null,null,null,null,"","R BONHEUR","LE CHATELET"]
[4020,null,null,null,null,"","R BONHEUR","LE CHATELET"]
[4021,null,null,null,null,"","R BONHEUR","LE CHATELET"]
[4022,null,null,null,null,"","R BONHEUR","LE CHATELET"]
[4023,null,null,null,null,"","R BONHEUR","LE CHATELET"]
[4024,null,null,null,null,"","R BONHEUR","LE CHATELET"]
[4025,null,null,null,null,"","R BONHEUR","LE CHATELET"]
[4026,null,null,null,null,"","R BONHEUR","LE CHATELET"]
[4027,null,null,null,null,"","R BONHEUR","LE CHATELET"]
[4028,null,null,null,null,"","R BONHEUR","LE CHATELET"]
[4029,null,null,null,null,"","R BONHEUR","LE CHATELET"]
[4030,null,null,null,null,"","R BONHEUR","LE CHATELET"]
[4031,null,null,null,null,"","R BONHEUR","LE CHATELET"]
[4032,null,null,null,null,"","R BONHEUR","LE CHATELET"]
[4033,null,null,null,null,{"$f":"IF(D4034=\"\",\"\",IF(E4034=\"f\",LOOKUP(D4034,cat_unss,cat_f),LOOKUP(D4034,cat_unss,cat_g)))","v":""},"R BONHEUR","LE CHATELET"]
[4034,null,null,null,null,"","R BONHEUR","LE CHATELET"]
[4035,null,null,null,null,"","R BONHEUR","LE CHATELET"]
[4036,null,null,null,null,"","R BONHEUR","LE CHATELET"]
[4037,null,null,null,null,"","R BONHEUR","LE CHATELET"]
[4038,null,null,null,null,"","R BONHEUR","LE CHATELET"]
[4039,null,null,null,null,"","R BONHEUR","LE CHATELET"]
[4040,null,null,null,null,"","R BONHEUR","LE CHATELET"]
[4041,null,null,null,null,"","R BONHEUR","LE CHATELET"]
[4042,null,null,null,null,"","R BONHEUR","LE CHATELET"]
[4043,null,null,null,null,"","R BONHEUR","LE CHATELET"]
[4044,null,null,null,null,"","R BONHEUR","LE CHATELET"]
[4045,null,null,null,null,"","R BONHEUR","LE CHATELET"]
[4046,null,null,null,null,"","R BONHEUR","LE CHATELET"]
[4047,null,null,null,null,"","R BONHEUR","LE CHATELET"]
[4048,null,null,null,null,"","R BONHEUR","LE CHATELET"]
[4049,null,null,null,null,"","R BONHEUR","LE CHATELET"]
[4050,null,null,null,null,"","R BONHEUR","LE CHATELET"]
[4051,null,null,null,null,"","R BONHEUR","LE CHATELET"]
[4052,null,null,null,null,"","R BONHEUR","LE CHATELET"]
[4053,null,null,null,null,"","R BONHEUR","LE CHATELET"]
[4054,null,null,null,null,"","R BONHEUR","LE CHATELET"]
[4055,null,null,null,null,"","R BONHEUR","LE CHATELET"]
[4056,null,null,null,null,"","R BONHEUR","LE CHATELET"]
[4057,null,null,null,null,"","R BONHEUR","LE CHATELET"]
[4058,null,null,null,null,"","R BONHEUR","LE CHATELET"]
[4059,null,null,null,null,"","R BONHEUR","LE CHATELET"]
[4060,null,null,null,null,"","R BONHEUR","LE CHATELET"]
[4061,null,null,null,null,"","R BONHEUR","LE CHATELET"]
[4062,null,null,null,null,"","R BONHEUR","LE CHATELET"]
[4063,null,null,null,null,"","R BONHEUR","LE CHATELET"]
[4064,null,null,null,null,"","R BONHEUR","LE CHATELET"]
[4065,null,null,null,null,"","R BONHEUR","LE CHATELET"]
[4066,null,null,null,null,"","R BONHEUR","LE CHATELET"]
[4067,null,null,null,null,"","R BONHEUR","LE CHATELET"]
[4068,null,null,null,null,"","R BONHEUR","LE CHATELET"]
[4069,null,null,null,null,"","R BONHEUR","LE CHATELET"]
[4070,null,null,null,null,"","R BONHEUR","LE CHATELET"]
[4071,null,null,null,null,"","R BONHEUR","LE CHATELET"]
[4072,null,null,null,null,"","R BONHEUR","LE CHATELET"]
[4073,null,null,null,null,"","R BONHEUR","LE CHATELET"]
[4074,null,null,null,null,"","R BONHEUR","LE CHATELET"]
[4075,null,null,null,null,"","R BONHEUR","LE CHATELET"]
[4076,null,null,null,null,"","R BONHEUR","LE CHATELET"]
[4077,null,null,null,null,"","R BONHEUR","LE CHATELET"]
[4078,null,null,null,null,"","R BONHEUR","LE CHATELET"]
[4079,null,null,null,null,"","R BONHEUR","LE CHATELET"]
[4080,null,null,null,null,"","R BONHEUR","LE CHATELET"]
[4081,null,null,null,null,"","R BONHEUR","LE CHATELET"]
[4082,null,null,null,null,"","R BONHEUR","LE CHATELET"]
[4083,null,null,null,null,"","R BONHEUR","LE CHATELET"]
[4084,null,null,null,null,"","R BONHEUR","LE CHATELET"]
[4085,null,null,null,null,"","R BONHEUR","LE CHATELET"]
[4086,null,null,null,null,"","R BONHEUR","LE CHATELET"]
[4087,null,null,null,null,"","R BONHEUR","LE CHATELET"]
[4088,null,null,null,null,"","R BONHEUR","LE CHATELET"]
[4089,null,null,null,null,"","R BONHEUR","LE CHATELET"]
[4090,null,null,null,null,"","R BONHEUR","LE CHATELET"]
[4091,null,null,null,null,"","R BONHEUR","LE CHATELET"]
[4092,null,null,null,null,"","R BONHEUR","LE CHATELET"]
[4093,null,null,null,null,"","R BONHEUR","LE CHATELET"]
[4094,null,null,null,null,"","R BONHEUR","LE CHATELET"]
[4095,null,null,null,null,"","R BONHEUR","LE CHATELET"]
[4096,null,null,null,null,"","R BONHEUR","LE CHATELET"]
[4097,null,null,null,null,{"$f":"IF(D4098=\"\",\"\",IF(E4098=\"f\",LOOKUP(D4098,cat_unss,cat_f),LOOKUP(D4098,cat_unss,cat_g)))","v":""},"R BONHEUR","LE CHATELET"]
[4098,null,null,null,null,"","R BONHEUR","LE CHATELET"]
[4099,null,null,null,null,"","R BONHEUR","LE CHATELET"]
[4100,null,null,null,null,"","R BONHEUR","LE CHATELET"]
[4101,null,null,null,null,"","R BONHEUR","LE CHATELET"]
[4102,null,null,null,null,"","R BONHEUR","LE CHATELET"]
[4103,null,null,null,null,"","R BONHEUR","LE CHATELET"]
[4104,null,null,null,null,"","R BONHEUR","LE CHATELET"]
[4105,null,null,null,null,"","R BONHEUR","LE CHATELET"]
[4106,null,null,null,null,"","R BONHEUR","LE CHATELET"]
[4107,null,null,null,null,"","R BONHEUR","LE CHATELET"]
[4108,null,null,null,null,"","R BONHEUR","LE CHATELET"]
[4109,null,null,null,null,"","R BONHEUR","LE CHATELET"]
[4110,null,null,null,null,"","R BONHEUR","LE CHATELET"]
[4111,null,null,null,null,"","R BONHEUR","LE CHATELET"]
[4112,null,null,null,null,"","R BONHEUR","LE CHATELET"]
[4113,null,null,null,null,"","R BONHEUR","LE CHATELET"]
[4114,null,null,null,null,"","R BONHEUR","LE CHATELET"]
[4115,null,null,null,null,"","R BONHEUR","LE CHATELET"]
[4116,null,null,null,null,"","R BONHEUR","LE CHATELET"]
[4117,null,null,null,null,"","R BONHEUR","LE CHATELET"]
[4118,null,null,null,null,"","R BONHEUR","LE CHATELET"]
[4119,null,null,null,null,"","R BONHEUR","LE CHATELET"]
[4120,null,null,null,null,"","R BONHEUR","LE CHATELET"]
[4121,null,null,null,null,"","R BONHEUR","LE CHATELET"]
[4122,null,null,null,null,"","R BONHEUR","LE CHATELET"]
[4123,null,null,null,null,"","R BONHEUR","LE CHATELET"]
[4124,null,null,null,null,"","R BONHEUR","LE CHATELET"]
[4125,null,null,null,null,"","R BONHEUR","LE CHATELET"]
[4126,null,null,null,null,"","R BONHEUR","LE CHATELET"]
[4127,null,null,null,null,"","R BONHEUR","LE CHATELET"]
[4128,null,null,null,null,"","R BONHEUR","LE CHATELET"]
[4129,null,null,null,null,"","R BONHEUR","LE CHATELET"]
[4130,null,null,null,null,"","R BONHEUR","LE CHATELET"]
[4131,null,null,null,null,"","R BONHEUR","LE CHATELET"]
[4132,null,null,null,null,"","R BONHEUR","LE CHATELET"]
[4133,null,null,null,null,"","R BONHEUR","LE CHATELET"]
[4134,null,null,null,null,"","R BONHEUR","LE CHATELET"]
[4135,null,null,null,null,"","R BONHEUR","LE CHATELET"]
[4136,null,null,null,null,"","R BONHEUR","LE CHATELET"]
[4137,null,null,null,null,"","R BONHEUR","LE CHATELET"]
[4138,null,null,null,null,"","R BONHEUR","LE CHATELET"]
[4139,null,null,null,null,"","R BONHEUR","LE CHATELET"]
[4140,null,null,null,null,"","R BONHEUR","LE CHATELET"]
[4141,null,null,null,null,"","R BONHEUR","LE CHATELET"]
[4142,null,null,null,null,"","R BONHEUR","LE CHATELET"]
[4143,null,null,null,null,"","R BONHEUR","LE CHATELET"]
[4144,null,null,null,null,"","R BONHEUR","LE CHATELET"]
[4145,null,null,null,null,"","R BONHEUR","LE CHATELET"]
[4146,null,null,null,null,"","R BONHEUR","LE CHATELET"]
[4147,null,null,null,null,"","R BONHEUR","LE CHATELET"]
[4148,null,null,null,null,"","R BONHEUR","LE CHATELET"]
[4149,null,null,null,null,"","R BONHEUR","LE CHATELET"]
[4150,null,null,null,null,"","R BONHEUR","LE CHATELET"]
[4151,null,null,null,null,"","R BONHEUR","LE CHATELET"]
[4152,null,null,null,null,"","R BONHEUR","LE CHATELET"]
[4153,null,null,null,null,"","R BONHEUR","LE CHATELET"]
[4154,null,null,null,null,"","R BONHEUR","LE CHATELET"]
[4155,null,null,null,null,"","R BONHEUR","LE CHATELET"]
[4156,null,null,null,null,"","R BONHEUR","LE CHATELET"]
[4157,null,null,null,null,"","R BONHEUR","LE CHATELET"]
[4158,null,null,null,null,"","R BONHEUR","LE CHATELET"]
[4159,null,null,null,null,"","R BONHEUR","LE CHATELET"]
[4160,null,null,null,null,"","R BONHEUR","LE CHATELET"]
[4161,null,null,null,null,{"$f":"IF(D4162=\"\",\"\",IF(E4162=\"f\",LOOKUP(D4162,cat_unss,cat_f),LOOKUP(D4162,cat_unss,cat_g)))","v":""},"R BONHEUR","LE CHATELET"]
[4162,null,null,null,null,"","R BONHEUR","LE CHATELET"]
[4163,null,null,null,null,"","R BONHEUR","LE CHATELET"]
[4164,null,null,null,null,"","R BONHEUR","LE CHATELET"]
[4165,null,null,null,null,"","R BONHEUR","LE CHATELET"]
[4166,null,null,null,null,"","R BONHEUR","LE CHATELET"]
[4167,null,null,null,null,"","R BONHEUR","LE CHATELET"]
[4168,null,null,null,null,"","R BONHEUR","LE CHATELET"]
[4169,null,null,null,null,"","R BONHEUR","LE CHATELET"]
[4170,null,null,null,null,"","R BONHEUR","LE CHATELET"]
[4171,null,null,null,null,"","R BONHEUR","LE CHATELET"]
[4172,null,null,null,null,"","R BONHEUR","LE CHATELET"]
[4173,null,null,null,null,"","R BONHEUR","LE CHATELET"]
[4174,null,null,null,null,"","R BONHEUR","LE CHATELET"]
[4175,null,null,null,null,"","R BONHEUR","LE CHATELET"]
[4176,null,null,null,null,"","R BONHEUR","LE CHATELET"]
[4177,null,null,null,null,"","R BONHEUR","LE CHATELET"]
[4178,null,null,null,null,"","R BONHEUR","LE CHATELET"]
[4179,null,null,null,null,"","R BONHEUR","LE CHATELET"]
[4180,null,null,null,null,"","R BONHEUR","LE CHATELET"]
[4181,null,null,null,null,"","R BONHEUR","LE CHATELET"]
[4182,null,null,null,null,"","R BONHEUR","LE CHATELET"]
[4183,null,null,null,null,"","R BONHEUR","LE CHATELET"]
[4184,null,null,null,null,"","R BONHEUR","LE CHATELET"]
[4185,null,null,null,null,"","R BONHEUR","LE CHATELET"]
[4186,null,null,null,null,"","R BONHEUR","LE CHATELET"]
[4187,null,null,null,null,"","R BONHEUR","LE CHATELET"]
[4188,null,null,null,null,"","R BONHEUR","LE CHATELET"]
[4189,null,null,null,null,"","R BONHEUR","LE CHATELET"]
[4190,null,null,null,null,"","R BONHEUR","LE CHATELET"]
[4191,null,null,null,null,"","R BONHEUR","LE CHATELET"]
[4192,null,null,null,null,"","R BONHEUR","LE CHATELET"]
[4193,null,null,null,null,"","R BONHEUR","LE CHATELET"]
[4194,null,null,null,null,"","R BONHEUR","LE CHATELET"]
[4195,null,null,null,null,"","R BONHEUR","LE CHATELET"]
[4196,null,null,null,null,"","R BONHEUR","LE CHATELET"]
[4197,null,null,null,null,"","R BONHEUR","LE CHATELET"]
[4198,null,null,null,null,"","R BONHEUR","LE CHATELET"]
[4199,null,null,null,null,"","R BONHEUR","LE CHATELET"]
[4200,null,null,null,null,"","R BONHEUR","LE CHATELET"]
[4201,null,null,null,null,""]
[4202,null,null,null,null,""]
[4203,null,null,null,null,""]
[4204,null,null,null,null,""]
[4205,null,null,null,null,""]
[4206,null,null,null,null,""]
[4207,null,null,null,null,""]
[4208,null,null,null,null,""]
[4209,null,null,null,null,""]
[4210,null,null,null,null,""]
[4211,null,null,null,null,""]
[4212,null,null,null,null,""]
[4213,null,null,null,null,""]
[4214,null,null,null,null,""]
[4215,null,null,null,null,""]
[4216,null,null,null,null,""]
[4217,null,null,null,null,""]
[4218,null,null,null,null,""]
[4219,null,null,null,null,""]
[4220,null,null,null,null,""]
[4221,null,null,null,null,""]
[4222,null,null,null,null,""]
[4223,null,null,null,null,""]
[4224,null,null,null,null,""]
[4225,null,null,null,null,{"$f":"IF(D4226=\"\",\"\",IF(E4226=\"f\",LOOKUP(D4226,cat_unss,cat_f),LOOKUP(D4226,cat_unss,cat_g)))","v":""}]
[4226,null,null,null,null,""]
[4227,null,null,null,null,""]
[4228,null,null,null,null,""]
[4229,null,null,null,null,""]
[4230,null,null,null,null,""]
[4231,null,null,null,null,""]
[4232,null,null,null,null,""]
[4233,null,null,null,null,""]
[4234,null,null,null,null,""]
[4235,null,null,null,null,""]
[4236,null,null,null,null,""]
[4237,null,null,null,null,""]
[4238,null,null,null,null,""]
[4239,null,null,null,null,""]
[4240,null,null,null,null,""]
[4241,null,null,null,null,"","POLITZER","DAMMARIE"]
[4242,null,null,null,null,"","POLITZER","DAMMARIE"]
[4243,null,null,null,null,"","POLITZER","DAMMARIE"]
[4244,null,null,null,null,"","POLITZER","DAMMARIE"]
[4245,null,null,null,null,"","POLITZER","DAMMARIE"]
[4246,null,null,null,null,"","POLITZER","DAMMARIE"]
[4247,null,null,null,null,"","POLITZER","DAMMARIE"]
[4248,null,null,null,null,"","POLITZER","DAMMARIE"]
[4249,null,null,null,null,"","POLITZER","DAMMARIE"]
[4250,null,null,null,null,"","POLITZER","DAMMARIE"]
[4251,null,null,null,null,"","POLITZER","DAMMARIE"]
[4252,null,null,null,null,"","POLITZER","DAMMARIE"]
[4253,null,null,null,null,"","POLITZER","DAMMARIE"]
[4254,null,null,null,null,"","POLITZER","DAMMARIE"]
[4255,null,null,null,null,"","POLITZER","DAMMARIE"]
[4256,null,null,null,null,"","POLITZER","DAMMARIE"]
[4257,null,null,null,null,"","POLITZER","DAMMARIE"]
[4258,null,null,null,null,"","POLITZER","DAMMARIE"]
[4259,null,null,null,null,"","POLITZER","DAMMARIE"]
[4260,null,null,null,null,""]
[4261,null,null,null,null,""]
[4262,null,null,null,null,""]
[4263,null,null,null,null,""]
[4264,null,null,null,null,""]
[4265,null,null,null,null,""]
[4266,null,null,null,null,""]
[4267,null,null,null,null,""]
[4268,null,null,null,null,""]
[4269,null,null,null,null,""]
[4270,null,null,null,null,""]
[4271,null,null,null,null,""]
[4272,null,null,null,null,""]
[4273,null,null,null,null,""]
[4274,null,null,null,null,""]
[4275,null,null,null,null,""]
[4276,null,null,null,null,""]
[4277,null,null,null,null,""]
[4278,null,null,null,null,""]
[4279,null,null,null,null,""]
[4280,null,null,null,null,""]
[4281,null,null,null,null,""]
[4282,null,null,null,null,""]
[4283,null,null,null,null,""]
[4284,null,null,null,null,""]
[4285,null,null,null,null,""]
[4286,null,null,null,null,""]
[4287,null,null,null,null,""]
[4288,null,null,null,null,""]
[4289,null,null,null,null,{"$f":"IF(D4290=\"\",\"\",IF(E4290=\"f\",LOOKUP(D4290,cat_unss,cat_f),LOOKUP(D4290,cat_unss,cat_g)))","v":""}]
[4290,null,null,null,null,""]
[4291,null,null,null,null,""]
[4292,null,null,null,null,""]
[4293,null,null,null,null,""]
[4294,null,null,null,null,""]
[4295,null,null,null,null,""]
[4296,null,null,null,null,""]
[4297,null,null,null,null,""]
[4298,null,null,null,null,""]
[4299,null,null,null,null,""]
[4300,null,null,null,null,""]
[4301,null,null,null,null,""]
[4302,null,null,null,null,""]
[4303,null,null,null,null,""]
[4304,null,null,null,null,""]
[4305,null,null,null,null,""]
[4306,null,null,null,null,""]
[4307,null,null,null,null,""]
[4308,null,null,null,null,""]
[4309,null,null,null,null,""]
[4310,null,null,null,null,""]
[4311,null,null,null,null,""]
[4312,null,null,null,null,""]
[4313,null,null,null,null,""]
[4314,null,null,null,null,""]
[4315,null,null,null,null,""]
[4316,null,null,null,null,""]
[4317,null,null,null,null,""]
[4318,null,null,null,null,""]
[4319,null,null,null,null,""]
[4320,null,null,null,null,""]
[4321,null,null,null,null,""]
[4322,null,null,null,null,""]
[4323,null,null,null,null,""]
[4324,null,null,null,null,""]
[4325,null,null,null,null,""]
[4326,null,null,null,null,""]
[4327,null,null,null,null,""]
[4328,null,null,null,null,""]
[4329,null,null,null,null,""]
[4330,null,null,null,null,""]
[4331,null,null,null,null,""]
[4332,null,null,null,null,""]
[4333,null,null,null,null,""]
[4334,null,null,null,null,""]
[4335,null,null,null,null,""]
[4336,null,null,null,null,""]
[4337,null,null,null,null,""]
[4338,null,null,null,null,""]
[4339,null,null,null,null,""]
[4340,null,null,null,null,""]
[4341,null,null,null,null,""]
[4342,null,null,null,null,""]
[4343,null,null,null,null,""]
[4344,null,null,null,null,""]
[4345,null,null,null,null,""]
[4346,null,null,null,null,""]
[4347,null,null,null,null,""]
[4348,null,null,null,null,""]
[4349,null,null,null,null,""]
[4350,null,null,null,null,""]
[4351,null,null,null,null,""]
[4352,null,null,null,null,""]
[4353,null,null,null,null,{"$f":"IF(D4354=\"\",\"\",IF(E4354=\"f\",LOOKUP(D4354,cat_unss,cat_f),LOOKUP(D4354,cat_unss,cat_g)))","v":""}]
[4354,null,null,null,null,""]
[4355,null,null,null,null,""]
[4356,null,null,null,null,""]
[4357,null,null,null,null,""]
[4358,null,null,null,null,""]
[4359,null,null,null,null,""]
[4360,null,null,null,null,""]
[4361,null,null,null,null,""]
[4362,null,null,null,null,""]
[4363,null,null,null,null,""]
[4364,null,null,null,null,""]
[4365,null,null,null,null,""]
[4366,null,null,null,null,""]
[4367,null,null,null,null,""]
[4368,null,null,null,null,""]
[4369,null,null,null,null,""]
[4370,null,null,null,null,""]
[4371,null,null,null,null,""]
[4372,null,null,null,null,""]
[4373,null,null,null,null,""]
[4374,null,null,null,null,""]
[4375,null,null,null,null,""]
[4376,null,null,null,null,""]
[4377,null,null,null,null,""]
[4378,null,null,null,null,""]
[4379,null,null,null,null,""]
[4380,null,null,null,null,""]
[4381,null,null,null,null,""]
[4382,null,null,null,null,""]
[4383,null,null,null,null,""]
[4384,null,null,null,null,""]
[4385,null,null,null,null,""]
[4386,null,null,null,null,""]
[4387,null,null,null,null,""]
[4388,null,null,null,null,""]
[4389,null,null,null,null,""]
[4390,null,null,null,null,""]
[4391,null,null,null,null,""]
[4392,null,null,null,null,""]
[4393,null,null,null,null,""]
[4394,null,null,null,null,""]
[4395,null,null,null,null,""]
[4396,null,null,null,null,""]
[4397,null,null,null,null,""]
[4398,null,null,null,null,""]
[4399,null,null,null,null,""]
[4400,null,null,null,null,""]
[4401,null,null,null,null,""]
[4402,null,null,null,null,""]
[4403,null,null,null,null,""]
[4404,null,null,null,null,""]
[4405,null,null,null,null,""]
[4406,null,null,null,null,""]
[4407,null,null,null,null,""]
[4408,null,null,null,null,""]
[4409,null,null,null,null,""]
[4410,null,null,null,null,""]
[4411,null,null,null,null,""]
[4412,null,null,null,null,""]
[4413,null,null,null,null,""]
[4414,null,null,null,null,""]
[4415,null,null,null,null,""]
[4416,null,null,null,null,""]
[4417,null,null,null,null,{"$f":"IF(D4418=\"\",\"\",IF(E4418=\"f\",LOOKUP(D4418,cat_unss,cat_f),LOOKUP(D4418,cat_unss,cat_g)))","v":""}]
[4418,null,null,null,null,""]
[4419,null,null,null,null,""]
[4420,null,null,null,null,""]
[4421,null,null,null,null,""]
[4422,null,null,null,null,""]
[4423,null,null,null,null,""]
[4424,null,null,null,null,""]
[4425,null,null,null,null,""]
[4426,null,null,null,null,""]
[4427,null,null,null,null,""]
[4428,null,null,null,null,""]
[4429,null,null,null,null,""]
[4430,null,null,null,null,""]
[4431,null,null,null,null,""]
[4432,null,null,null,null,""]
[4433,null,null,null,null,""]
[4434,null,null,null,null,""]
[4435,null,null,null,null,""]
[4436,null,null,null,null,""]
[4437,null,null,null,null,""]
[4438,null,null,null,null,""]
[4439,null,null,null,null,""]
[4440,null,null,null,null,""]
[4441,null,null,null,null,""]
[4442,null,null,null,null,""]
[4443,null,null,null,null,""]
[4444,null,null,null,null,""]
[4445,null,null,null,null,""]
[4446,null,null,null,null,""]
[4447,null,null,null,null,""]
[4448,null,null,null,null,""]
[4449,null,null,null,null,""]
[4450,null,null,null,null,""]
[4451,null,null,null,null,""]
[4452,null,null,null,null,""]
[4453,null,null,null,null,""]
[4454,null,null,null,null,""]
[4455,null,null,null,null,""]
[4456,null,null,null,null,""]
[4457,null,null,null,null,""]
[4458,null,null,null,null,""]
[4459,null,null,null,null,""]
[4460,null,null,null,null,""]
[4461,null,null,null,null,""]
[4462,null,null,null,null,""]
[4463,null,null,null,null,""]
[4464,null,null,null,null,""]
[4465,null,null,null,null,""]
[4466,null,null,null,null,""]
[4467,null,null,null,null,""]
[4468,null,null,null,null,""]
[4469,null,null,null,null,""]
[4470,null,null,null,null,""]
[4471,null,null,null,null,""]
[4472,null,null,null,null,""]
[4473,null,null,null,null,""]
[4474,null,null,null,null,""]
[4475,null,null,null,null,""]
[4476,null,null,null,null,""]
[4477,null,null,null,null,""]
[4478,null,null,null,null,""]
[4479,null,null,null,null,""]
[4480,null,null,null,null,""]
[4481,null,null,null,null,{"$f":"IF(D4482=\"\",\"\",IF(E4482=\"f\",LOOKUP(D4482,cat_unss,cat_f),LOOKUP(D4482,cat_unss,cat_g)))","v":""}]
[4482,null,null,null,null,""]
[4483,null,null,null,null,""]
[4484,null,null,null,null,""]
[4485,null,null,null,null,""]
[4486,null,null,null,null,""]
[4487,null,null,null,null,""]
[4488,null,null,null,null,""]
[4489,null,null,null,null,""]
[4490,null,null,null,null,""]
[4491,null,null,null,null,""]
[4492,null,null,null,null,""]
[4493,null,null,null,null,""]
[4494,null,null,null,null,""]
[4495,null,null,null,null,""]
[4496,null,null,null,null,""]
[4497,null,null,null,null,""]
[4498,null,null,null,null,""]
[4499,null,null,null,null,""]
[4500,null,null,null,null,""]
[4501,null,null,null,null,""]
[4502,null,null,null,null,""]
[4503,null,null,null,null,""]
[4504,null,null,null,null,""]
[4505,null,null,null,null,""]
[4506,null,null,null,null,""]
[4507,null,null,null,null,""]
[4508,null,null,null,null,""]
[4509,null,null,null,null,""]
[4510,null,null,null,null,""]
[4511,null,null,null,null,""]
[4512,null,null,null,null,""]
[4513,null,null,null,null,""]
[4514,null,null,null,null,""]
[4515,null,null,null,null,""]
[4516,null,null,null,null,""]
[4517,null,null,null,null,""]
[4518,null,null,null,null,""]
[4519,null,null,null,null,""]
[4520,null,null,null,null,""]
[4521,null,null,null,null,""]
[4522,null,null,null,null,""]
[4523,null,null,null,null,""]
[4524,null,null,null,null,""]
[4525,null,null,null,null,""]
[4526,null,null,null,null,""]
[4527,null,null,null,null,""]
[4528,null,null,null,null,""]
[4529,null,null,null,null,""]
[4530,null,null,null,null,""]
[4531,null,null,null,null,""]
[4532,null,null,null,null,""]
[4533,null,null,null,null,""]
[4534,null,null,null,null,""]
[4535,null,null,null,null,""]
[4536,null,null,null,null,""]
[4537,null,null,null,null,""]
[4538,null,null,null,null,""]
[4539,null,null,null,null,""]
[4540,null,null,null,null,""]
[4541,null,null,null,null,""]
[4542,null,null,null,null,""]
[4543,null,null,null,null,""]
[4544,null,null,null,null,""]
[4545,null,null,null,null,{"$f":"IF(D4546=\"\",\"\",IF(E4546=\"f\",LOOKUP(D4546,cat_unss,cat_f),LOOKUP(D4546,cat_unss,cat_g)))","v":""}]
[4546,null,null,null,null,""]
[4547,null,null,null,null,""]
[4548,null,null,null,null,""]
[4549,null,null,null,null,""]
[4550,null,null,null,null,""]
[4551,null,null,null,null,""]
[4552,null,null,null,null,""]
[4553,null,null,null,null,""]
[4554,null,null,null,null,""]
[4555,null,null,null,null,""]
[4556,null,null,null,null,""]
[4557,null,null,null,null,""]
[4558,null,null,null,null,""]
[4559,null,null,null,null,""]
[4560,null,null,null,null,""]
[4561,null,null,null,null,""]
[4562,null,null,null,null,""]
[4563,null,null,null,null,""]
[4564,null,null,null,null,""]
[4565,null,null,null,null,""]
[4566,null,null,null,null,""]
[4567,null,null,null,null,""]
[4568,null,null,null,null,""]
[4569,null,null,null,null,""]
[4570,null,null,null,null,""]
[4571,null,null,null,null,""]
[4572,null,null,null,null,""]
[4573,null,null,null,null,""]
[4574,null,null,null,null,""]
[4575,null,null,null,null,""]
[4576,null,null,null,null,""]
[4577,null,null,null,null,""]
[4578,null,null,null,null,""]
[4579,null,null,null,null,""]
[4580,null,null,null,null,""]
[4581,null,null,null,null,""]
[4582,null,null,null,null,""]
[4583,null,null,null,null,""]
[4584,null,null,null,null,""]
[4585,null,null,null,null,""]
[4586,null,null,null,null,""]
[4587,null,null,null,null,""]
[4588,null,null,null,null,""]
[4589,null,null,null,null,""]
[4590,null,null,null,null,""]
[4591,null,null,null,null,""]
[4592,null,null,null,null,""]
[4593,null,null,null,null,""]
[4594,null,null,null,null,""]
[4595,null,null,null,null,""]
[4596,null,null,null,null,""]
[4597,null,null,null,null,""]
[4598,null,null,null,null,""]
[4599,null,null,null,null,""]
[4600,null,null,null,null,""]
[4601,null,null,null,null,""]
[4602,null,null,null,null,""]
[4603,null,null,null,null,""]
[4604,null,null,null,null,""]
[4605,null,null,null,null,""]
[4606,null,null,null,null,""]
[4607,null,null,null,null,""]
[4608,null,null,null,null,""]
[4609,null,null,null,null,{"$f":"IF(D4610=\"\",\"\",IF(E4610=\"f\",LOOKUP(D4610,cat_unss,cat_f),LOOKUP(D4610,cat_unss,cat_g)))","v":""}]
[4610,null,null,null,null,""]
[4611,null,null,null,null,""]
[4612,null,null,null,null,""]
[4613,null,null,null,null,""]
[4614,null,null,null,null,""]
[4615,null,null,null,null,""]
[4616,null,null,null,null,""]
[4617,null,null,null,null,""]
[4618,null,null,null,null,""]
[4619,null,null,null,null,""]
[4620,null,null,null,null,""]
[4621,null,null,null,null,""]
[4622,null,null,null,null,""]
[4623,null,null,null,null,""]
[4624,null,null,null,null,""]
[4625,null,null,null,null,""]
[4626,null,null,null,null,""]
[4627,null,null,null,null,""]
[4628,null,null,null,null,""]
[4629,null,null,null,null,""]
[4630,null,null,null,null,""]
[4631,null,null,null,null,""]
[4632,null,null,null,null,""]
[4633,null,null,null,null,""]
[4634,null,null,null,null,""]
[4635,null,null,null,null,""]
[4636,null,null,null,null,""]
[4637,null,null,null,null,""]
[4638,null,null,null,null,""]
[4639,null,null,null,null,""]
[4640,null,null,null,null,""]
[4641,null,null,null,null,""]
[4642,null,null,null,null,""]
[4643,null,null,null,null,""]
[4644,null,null,null,null,""]
[4645,null,null,null,null,""]
[4646,null,null,null,null,""]
[4647,null,null,null,null,""]
[4648,null,null,null,null,""]
[4649,null,null,null,null,""]
[4650,null,null,null,null,""]
[4651,null,null,null,null,""]
[4652,null,null,null,null,""]
[4653,null,null,null,null,""]
[4654,null,null,null,null,""]
[4655,null,null,null,null,""]
[4656,null,null,null,null,""]
[4657,null,null,null,null,""]
[4658,null,null,null,null,""]
[4659,null,null,null,null,""]
[4660,null,null,null,null,""]
[4661,null,null,null,null,""]
[4662,null,null,null,null,""]
[4663,null,null,null,null,""]
[4664,null,null,null,null,""]
[4665,null,null,null,null,""]
[4666,null,null,null,null,""]
[4667,null,null,null,null,""]
[4668,null,null,null,null,""]
[4669,null,null,null,null,""]
[4670,null,null,null,null,""]
[4671,null,null,null,null,""]
[4672,null,null,null,null,""]
[4673,null,null,null,null,{"$f":"IF(D4674=\"\",\"\",IF(E4674=\"f\",LOOKUP(D4674,cat_unss,cat_f),LOOKUP(D4674,cat_unss,cat_g)))","v":""}]
[4674,null,null,null,null,""]
[4675,null,null,null,null,""]
[4676,null,null,null,null,""]
[4677,null,null,null,null,""]
[4678,null,null,null,null,""]
[4679,null,null,null,null,""]
[4680,null,null,null,null,""]
[4681,null,null,null,null,""]
[4682,null,null,null,null,""]
[4683,null,null,null,null,""]
[4684,null,null,null,null,""]
[4685,null,null,null,null,""]
[4686,null,null,null,null,""]
[4687,null,null,null,null,""]
[4688,null,null,null,null,""]
[4689,null,null,null,null,""]
[4690,null,null,null,null,""]
[4691,null,null,null,null,""]
[4692,null,null,null,null,""]
[4693,null,null,null,null,""]
[4694,null,null,null,null,""]
[4695,null,null,null,null,""]
[4696,null,null,null,null,""]
[4697,null,null,null,null,""]
[4698,null,null,null,null,""]
[4699,null,null,null,null,""]
[4700,null,null,null,null,""]
[4701,null,null,null,null,""]
[4702,null,null,null,null,""]
[4703,null,null,null,null,""]
[4704,null,null,null,null,""]
[4705,null,null,null,null,""]
[4706,null,null,null,null,""]
[4707,null,null,null,null,""]
[4708,null,null,null,null,""]
[4709,null,null,null,null,""]
[4710,null,null,null,null,""]
[4711,null,null,null,null,""]
[4712,null,null,null,null,""]
[4713,null,null,null,null,""]
[4714,null,null,null,null,""]
[4715,null,null,null,null,""]
[4716,null,null,null,null,""]
[4717,null,null,null,null,""]
[4718,null,null,null,null,""]
[4719,null,null,null,null,""]
[4720,null,null,null,null,""]
[4721,null,null,null,null,""]
[4722,null,null,null,null,""]
[4723,null,null,null,null,""]
[4724,null,null,null,null,""]
[4725,null,null,null,null,""]
[4726,null,null,null,null,""]
[4727,null,null,null,null,""]
[4728,null,null,null,null,""]
[4729,null,null,null,null,""]
[4730,null,null,null,null,""]
[4731,null,null,null,null,""]
[4732,null,null,null,null,""]
[4733,null,null,null,null,""]
[4734,null,null,null,null,""]
[4735,null,null,null,null,""]
[4736,null,null,null,null,""]
[4737,null,null,null,null,{"$f":"IF(D4738=\"\",\"\",IF(E4738=\"f\",LOOKUP(D4738,cat_unss,cat_f),LOOKUP(D4738,cat_unss,cat_g)))","v":""}]
[4738,null,null,null,null,""]
[4739,null,null,null,null,""]
[4740,null,null,null,null,""]
[4741,null,null,null,null,""]
[4742,null,null,null,null,""]
[4743,null,null,null,null,""]
[4744,null,null,null,null,""]
[4745,null,null,null,null,""]
[4746,null,null,null,null,""]
[4747,null,null,null,null,""]
[4748,null,null,null,null,""]
[4749,null,null,null,null,""]
[4750,null,null,null,null,""]
[4751,null,null,null,null,""]
[4752,null,null,null,null,""]
[4753,null,null,null,null,""]
[4754,null,null,null,null,""]
[4755,null,null,null,null,""]
[4756,null,null,null,null,""]
[4757,null,null,null,null,""]
[4758,null,null,null,null,""]
[4759,null,null,null,null,""]
[4760,null,null,null,null,""]
[4761,null,null,null,null,""]
[4762,null,null,null,null,""]
[4763,null,null,null,null,""]
[4764,null,null,null,null,""]
[4765,null,null,null,null,""]
[4766,null,null,null,null,""]
[4767,null,null,null,null,""]
[4768,null,null,null,null,""]
[4769,null,null,null,null,""]
[4770,null,null,null,null,""]
[4771,null,null,null,null,""]
[4772,null,null,null,null,""]
[4773,null,null,null,null,""]
[4774,null,null,null,null,""]
[4775,null,null,null,null,""]
[4776,null,null,null,null,""]
[4777,null,null,null,null,""]
[4778,null,null,null,null,""]
[4779,null,null,null,null,""]
[4780,null,null,null,null,""]
[4781,null,null,null,null,""]
[4782,null,null,null,null,""]
[4783,null,null,null,null,""]
[4784,null,null,null,null,""]
[4785,null,null,null,null,""]
[4786,null,null,null,null,""]
[4787,null,null,null,null,""]
[4788,null,null,null,null,""]
[4789,null,null,null,null,""]
[4790,null,null,null,null,""]
[4791,null,null,null,null,""]
[4792,null,null,null,null,""]
[4793,null,null,null,null,""]
[4794,null,null,null,null,""]
[4795,null,null,null,null,""]
[4796,null,null,null,null,""]
[4797,null,null,null,null,""]
[4798,null,null,null,null,""]
[4799,null,null,null,null,""]
[4800,null,null,null,null,""]
[4801,null,null,null,null,{"$f":"IF(D4802=\"\",\"\",IF(E4802=\"f\",LOOKUP(D4802,cat_unss,cat_f),LOOKUP(D4802,cat_unss,cat_g)))","v":""}]
[4802,null,null,null,null,""]
[4803,null,null,null,null,""]
[4804,null,null,null,null,""]
[4805,null,null,null,null,""]
[4806,null,null,null,null,""]
[4807,null,null,null,null,""]
[4808,null,null,null,null,""]
[4809,null,null,null,null,""]
[4810,null,null,null,null,""]
[4811,null,null,null,null,""]
[4812,null,null,null,null,""]
[4813,null,null,null,null,""]
[4814,null,null,null,null,""]
[4815,null,null,null,null,""]
[4816,null,null,null,null,""]
[4817,null,null,null,null,""]
[4818,null,null,null,null,""]
[4819,null,null,null,null,""]
[4820,null,null,null,null,""]
[4821,null,null,null,null,""]
[4822,null,null,null,null,""]
[4823,null,null,null,null,""]
[4824,null,null,null,null,""]
[4825,null,null,null,null,""]
[4826,null,null,null,null,""]
[4827,null,null,null,null,""]
[4828,null,null,null,null,""]
[4829,null,null,null,null,""]
[4830,null,null,null,null,""]
[4831,null,null,null,null,""]
[4832,null,null,null,null,""]
[4833,null,null,null,null,""]
[4834,null,null,null,null,""]
[4835,null,null,null,null,""]
[4836,null,null,null,null,""]
[4837,null,null,null,null,""]
[4838,null,null,null,null,""]
[4839,null,null,null,null,""]
[4840,null,null,null,null,""]
[4841,null,null,null,null,""]
[4842,null,null,null,null,""]
[4843,null,null,null,null,""]
[4844,null,null,null,null,""]
[4845,null,null,null,null,""]
[4846,null,null,null,null,""]
[4847,null,null,null,null,""]
[4848,null,null,null,null,""]
[4849,null,null,null,null,""]
[4850,null,null,null,null,""]
[4851,null,null,null,null,""]
[4852,null,null,null,null,""]
[4853,null,null,null,null,""]
[4854,null,null,null,null,""]
[4855,null,null,null,null,""]
[4856,null,null,null,null,""]
[4857,null,null,null,null,""]
[4858,null,null,null,null,""]
[4859,null,null,null,null,""]
[4860,null,null,null,null,""]
[4861,null,null,null,null,""]
[4862,null,null,null,null,""]
[4863,null,null,null,null,""]
[4864,null,null,null,null,""]
[4865,null,null,null,null,{"$f":"IF(D4866=\"\",\"\",IF(E4866=\"f\",LOOKUP(D4866,cat_unss,cat_f),LOOKUP(D4866,cat_unss,cat_g)))","v":""}]
[4866,null,null,null,null,""]
[4867,null,null,null,null,""]
[4868,null,null,null,null,""]
[4869,null,null,null,null,""]
[4870,null,null,null,null,""]
[4871,null,null,null,null,""]
[4872,null,null,null,null,""]
[4873,null,null,null,null,""]
[4874,null,null,null,null,""]
[4875,null,null,null,null,""]
[4876,null,null,null,null,""]
[4877,null,null,null,null,""]
[4878,null,null,null,null,""]
[4879,null,null,null,null,""]
[4880,null,null,null,null,""]
[4881,null,null,null,null,""]
[4882,null,null,null,null,""]
[4883,null,null,null,null,""]
[4884,null,null,null,null,""]
[4885,null,null,null,null,""]
[4886,null,null,null,null,""]
[4887,null,null,null,null,""]
[4888,null,null,null,null,""]
[4889,null,null,null,null,""]
[4890,null,null,null,null,""]
[4891,null,null,null,null,""]
[4892,null,null,null,null,""]
[4893,null,null,null,null,""]
[4894,null,null,null,null,""]
[4895,null,null,null,null,""]
[4896,null,null,null,null,""]
[4897,null,null,null,null,""]
[4898,null,null,null,null,""]
[4899,null,null,null,null,""]
[4900,null,null,null,null,""]
[4901,null,null,null,null,""]
[4902,null,null,null,null,""]
[4903,null,null,null,null,""]
[4904,null,null,null,null,""]
[4905,null,null,null,null,""]
[4906,null,null,null,null,""]
[4907,null,null,null,null,""]
[4908,null,null,null,null,""]
[4909,null,null,null,null,""]
[4910,null,null,null,null,""]
[4911,null,null,null,null,""]
[4912,null,null,null,null,""]
[4913,null,null,null,null,""]
[4914,null,null,null,null,""]
[4915,null,null,null,null,""]
[4916,null,null,null,null,""]
[4917,null,null,null,null,""]
[4918,null,null,null,null,""]
[4919,null,null,null,null,""]
[4920,null,null,null,null,""]
[4921,null,null,null,null,""]
[4922,null,null,null,null,""]
[4923,null,null,null,null,""]
[4924,null,null,null,null,""]
[4925,null,null,null,null,""]
[4926,null,null,null,null,""]
[4927,null,null,null,null,""]
[4928,null,null,null,null,""]
[4929,null,null,null,null,{"$f":"IF(D4930=\"\",\"\",IF(E4930=\"f\",LOOKUP(D4930,cat_unss,cat_f),LOOKUP(D4930,cat_unss,cat_g)))","v":""}]
[4930,null,null,null,null,""]
[4931,null,null,null,null,""]
[4932,null,null,null,null,""]
[4933,null,null,null,null,""]
[4934,null,null,null,null,""]
[4935,null,null,null,null,""]
[4936,null,null,null,null,""]
[4937,null,null,null,null,""]
[4938,null,null,null,null,""]
[4939,null,null,null,null,""]
[4940,null,null,null,null,""]
[4941,null,null,null,null,""]
[4942,null,null,null,null,""]
[4943,null,null,null,null,""]
[4944,null,null,null,null,""]
[4945,null,null,null,null,""]
[4946,null,null,null,null,""]
[4947,null,null,null,null,""]
[4948,null,null,null,null,""]
[4949,null,null,null,null,""]
[4950,null,null,null,null,""]
[4951,null,null,null,null,""]
[4952,null,null,null,null,""]
[4953,null,null,null,null,""]
[4954,null,null,null,null,""]
[4955,null,null,null,null,""]
[4956,null,null,null,null,""]
[4957,null,null,null,null,""]
[4958,null,null,null,null,""]
[4959,null,null,null,null,""]
[4960,null,null,null,null,""]
[4961,null,null,null,null,""]
[4962,null,null,null,null,""]
[4963,null,null,null,null,""]
[4964,null,null,null,null,""]
[4965,null,null,null,null,""]
[4966,null,null,null,null,""]
[4967,null,null,null,null,""]
[4968,null,null,null,null,""]
[4969,null,null,null,null,""]
[4970,null,null,null,null,""]
[4971,null,null,null,null,""]
[4972,null,null,null,null,""]
[4973,null,null,null,null,""]
[4974,null,null,null,null,""]
[4975,null,null,null,null,""]
[4976,null,null,null,null,""]
[4977,null,null,null,null,""]
[4978,null,null,null,null,""]
[4979,null,null,null,null,""]
[4980,null,null,null,null,""]
[4981,null,null,null,null,""]
[4982,null,null,null,null,""]
[4983,null,null,null,null,""]
[4984,null,null,null,null,""]
[4985,null,null,null,null,""]
[4986,null,null,null,null,""]
[4987,null,null,null,null,""]
[4988,null,null,null,null,""]
[4989,null,null,null,null,""]
[4990,null,null,null,null,""]
[4991,null,null,null,null,""]
[4992,null,null,null,null,""]
[4993,null,null,null,null,{"$f":"IF(D4994=\"\",\"\",IF(E4994=\"f\",LOOKUP(D4994,cat_unss,cat_f),LOOKUP(D4994,cat_unss,cat_g)))","v":""}]
[4994,null,null,null,null,""]
[4995,null,null,null,null,""]
[4996,null,null,null,null,""]
[4997,null,null,null,null,""]
[4998,null,null,null,null,""]
[4999,null,null,null,null,""]
[5000,null,null,null,null,""]

{"sheet":"Effectifs par collèges","index":2,"n_rows":39,"n_cols":18,"rows_kept":39,"cut":false,"hidden":false,"merged":[[0,0,0,15],[4,17,5,17],[8,17,9,17]]}
["EFFECTIFS PAR ETABLISSEMENT DU DISTRICT DE MELUN"]
[]
[null,{"$f":"Dossards!P13","v":"MELUN"},{"$f":"Dossards!P13","v":"MELUN"},{"$f":"Dossards!P15","v":"VERNEUIL"},{"$f":"Dossards!P13","v":"MELUN"},{"$f":"Dossards!P19","v":"PERTHES"},{"$f":"Dossards!P14","v":"DAMMARIE"},{"$f":"Dossards!P17","v":"LE MEE"},{"$f":"Dossards!P18","v":"PONTHIERRY"},{"$f":"Dossards!P13","v":"MELUN"},"MELUN",{"$f":"Dossards!P17","v":"LE MEE"},{"$f":"Dossards!P21","v":"VAUX"},{"$f":"Dossards!P16","v":"VOISENON"},{"$f":"Dossards!P20","v":"LE CHATELET"},{"$f":"Dossards!P14","v":"DAMMARIE"}]
[null,{"$f":"Dossards!$L13","v":"BROSSOLETTE"},{"$f":"Dossards!$L14","v":"CAPUCINS"},{"$f":"Dossards!$L15","v":"CH PEGUY"},{"$f":"Dossards!$L16","v":"CHOPIN"},{"$f":"Dossards!$L17","v":"DE PISAN"},{"$f":"Dossards!$L18","v":"DOISNEAU"},{"$f":"Dossards!$L19","v":"ELSA TRIOLET"},{"$f":"Dossards!$L20","v":"F VILLON"},{"$f":"Dossards!$L21","v":"J AMYOT"},{"$f":"Dossards!$L22","v":"J D'ARC"},{"$f":"Dossards!$L23","v":"LA FONTAINE"},{"$f":"Dossards!$L24","v":"LA MARE AUX CHAMPS"},{"$f":"Dossards!$L25","v":"NAZARETH"},{"$f":"Dossards!$L26","v":"R BONHEUR"},{"$f":"Dossards!$L27","v":"POLITZER"}]
["BF1",{"$f":"IF(COUNTA(benjaminesf1)=0,\"\",COUNTIF(benjaminesf1,B$4))","v":{"$error":"#REF!"}},{"$error":"#REF!"},{"$error":"#REF!"},{"$error":"#REF!"},{"$error":"#REF!"},{"$error":"#REF!"},{"$error":"#REF!"},{"$error":"#REF!"},{"$error":"#REF!"},{"$error":"#REF!"},{"$error":"#REF!"},{"$error":"#REF!"},{"$error":"#REF!"},{"$error":"#REF!"},{"$error":"#REF!"},{"$f":"SUM(B5:P5)","v":{"$error":"#REF!"}},{"$f":"Q5+Q6","v":{"$error":"#REF!"}}]
["BF2",{"$f":"IF(COUNTA(benjaminesf2)=0,\"\",COUNTIF(benjaminesf2,B$4))","v":{"$error":"#REF!"}},{"$error":"#REF!"},{"$error":"#REF!"},{"$error":"#REF!"},{"$error":"#REF!"},{"$error":"#REF!"},{"$error":"#REF!"},{"$error":"#REF!"},{"$error":"#REF!"},{"$error":"#REF!"},{"$error":"#REF!"},{"$error":"#REF!"},{"$error":"#REF!"},{"$error":"#REF!"},{"$error":"#REF!"},{"$f":"SUM(B6:P6)","v":{"$error":"#REF!"}}]
["MF",{"$f":"IF(COUNTA(MINIMESF)=0,\"\",COUNTIF(MINIMESF,B$4))","v":4},2,23,3,7,3,5,0,9,2,4,13,2,8,0,85]
["CF",{"$f":"IF(COUNTA(CADETTES)=0,\"\",COUNTIF(CADETTES,B$4))","v":0},0,0,0,0,0,1,0,0,0,0,1,0,0,0,2]
["BG1",{"$f":"IF(COUNTA(Benjamins1)=0,\"\",COUNTIF(Benjamins1,B$4))","v":8},6,15,9,10,6,8,0,4,14,2,4,8,4,0,98,{"$f":"Q9+Q10","v":161}]
["BG2",{"$f":"IF(COUNTA(Benjamins2)=0,\"\",COUNTIF(Benjamins2,B$4))","v":8},5,9,12,7,1,4,3,1,2,0,7,0,4,0,63]
["MG",{"$f":"IF(COUNTA(MINIMESG)=0,\"\",COUNTIF(MINIMESG,B$4))","v":7},2,19,2,7,6,2,1,4,5,1,11,4,8,0,79]
["CG",{"$f":"IF(COUNTA(CADETSG)=0,\"\",COUNTIF(CADETSG,B$4))","v":0},1,0,0,0,1,0,0,2,0,0,0,0,0,0,4]
["TOTAL",{"$f":"SUM(B5:B12)","v":{"$error":"#REF!"}},{"$error":"#REF!"},{"$error":"#REF!"},{"$error":"#REF!"},{"$error":"#REF!"},{"$error":"#REF!"},{"$error":"#REF!"},{"$error":"#REF!"},{"$error":"#REF!"},{"$error":"#REF!"},{"$error":"#REF!"},{"$error":"#REF!"},{"$error":"#REF!"},{"$error":"#REF!"},{"$error":"#REF!"},{"$error":"#REF!"}]
[]
[]
[]
[]
[null,null,null,"EFFECTIF","CROSS","TOTAL",{"$f":"SUM(B13:P13)","v":{"$error":"#REF!"}}]
[null,null,null,null,null,"FILLES",{"$f":"SUM(B5:P8)","v":{"$error":"#REF!"}},null,null,null,null,null,null,"PERTHES","2015-11-04"]
[null,null,null,null,null,"GARCONS",{"$f":"SUM(B9:P12)","v":244}]
[]
[]
[]
[]
[]
[]
[]
[]
[]
[]
[]
[]
[]
[]
[]
[]
[]
[]
[null,",=SI(NBVAL(benjaminesf2)=0;\"\";NB.SI(benjaminesf2;B$4))"]

{"sheet":"Classt BF1","index":3,"n_rows":285,"n_cols":9,"rows_kept":285,"cut":false,"hidden":false,"merged":[[1,1,1,8]]}
[]
[null,"CROSS DU DISTRICT\nBENJAMINES CLASSEMENT SCRATCH"]
[]
[null,"Dossard","PLACES","NOMS","PRENOMS","CATE","ETABLISSEMENT","VILLE","N°"]
[null,721,1,{"$f":"IF($B5=\"\",\"\",LOOKUP($B5,BASE,nom))","v":"MICHAUD"},{"$f":"IF($B5=\"\",\"\",LOOKUP($B5,BASE,prenom))","v":"Maelle"},{"$f":"IF($B5=\"\",\"\",LOOKUP($B5,BASE,cat))","v":"BF1"},{"$f":"IF($B5=\"\",\"\",LOOKUP($B5,BASE,etab))","v":"CH PEGUY"},{"$f":"IF($B5=\"\",\"\",LOOKUP($B5,BASE,VILLE))","v":"VERNEUIL"},{"$f":"IF($B5=\"\",\"\",LOOKUP($B5,BASE,Num))","v":0}]
[null,3316,2,"KAOUA","Lucie","BF1","LA MARE AUX CHAMPS","VAUX",0]
[null,1514,3,"EL GHAZOUANI","Fatima","BF1","DOISNEAU","DAMMARIE",0]
[null,3901,4,"LABOUDIE","Amel","BF1","R BONHEUR","LE CHATELET",0]
[null,32,5,"DRAME SIMAGA","Bintou","BF1","BROSSOLETTE","MELUN",0]
[null,3308,6,"ZINGLE","Léna","BF1","LA MARE AUX CHAMPS","VAUX",0]
[null,1862,7,"RAMOUL","Fatimazahra","BF1","ELSA TRIOLET","LE MEE",0]
[null,3315,8,"FONTYN","Tiffaine","BF1","LA MARE AUX CHAMPS","VAUX",0]
[null,724,9,"SWIDERSKI","Juliette","BF1","CH PEGUY","VERNEUIL",0]
[null,730,10,"DELHAYE","Louna","BF1","CH PEGUY","VERNEUIL",0]
[null,2102,11,"NAGAUD","Lauriane","BF1","F VILLON","PONTHIERRY",0]
[null,1863,12,"HENDA","Farah","BF1","ELSA TRIOLET","LE MEE",0]
[null,2716,13,"MERARIO","laurine","BF1","J D'ARC","MELUN",0]
[null,2447,14,"MOUDACHE","Maissa","BF1","J AMYOT","MELUN",0]
[null,2104,15,"FURLANETTO","Margaux","BF1","F VILLON","PONTHIERRY",0]
[null,1861,16,"EL MAZIANI","Fatima","BF1","ELSA TRIOLET","LE MEE",0]
[null,3921,17,"PATERNI","Emma","MF","R BONHEUR","LE CHATELET",0]
[null,2711,18,"PETILLAT","laura","BF1","J D'ARC","MELUN",0]
[null,33,19,"DANFA","Aissatou","BF1","BROSSOLETTE","MELUN",0]
[null,1523,20,"DINKELDAIN","Aéla","BF1","DOISNEAU","DAMMARIE",0]
[null,1209,21,"SERVEAUX","Lisa","BF1","DE PISAN","PERTHES",0]
[null,1868,22,"HADJI","Lina","BF1","ELSA TRIOLET","LE MEE",0]
[null,2446,23,"PETIT","Emilie","BF1","J AMYOT","MELUN",0]
[null,2101,24,"KIMPE KOMBE","Davina","BF1","F VILLON","PONTHIERRY",0]
[null,725,25,"RENARD","Lola","BF1","CH PEGUY","VERNEUIL",0]
[null,2733,26,"STAGNARO","lucie","BF1","J D'ARC","MELUN",0]
[null,735,27,"MARIA","Clara","BF1","CH PEGUY","VERNEUIL",0]
[null,733,28,"GIRBAL","Nolina","BF1","CH PEGUY","VERNEUIL",0]
[null,1204,29,"LARCHE","Aliénor","BF1","DE PISAN","PERTHES",0]
[null,2703,30,"ERCOL","eloan","BF1","J D'ARC","MELUN",0]
[null,3606,31,"PENNEC","Solenn","BF1","NAZARETH","VOISENON",0]
[null,727,32,"SINDEZINGUE","Isabelle","BF1","CH PEGUY","VERNEUIL",0]
[null,729,33,"LIEPPE","Manon","BF1","CH PEGUY","VERNEUIL",0]
[null,731,34,"BERTHOL","Laury","BF1","CH PEGUY","VERNEUIL",0]
[null,1512,35,"BAHLAGUI","Shirel","BF1","DOISNEAU","DAMMARIE",0]
[null,2752,36,"FAHIM","shaima","BF1","J D'ARC","MELUN",0]
[null,3902,37,"KUENTZ","Léna","BF1","R BONHEUR","LE CHATELET",0]
[null,1208,38,"DECOLOGNE","Arwen","BF1","DE PISAN","PERTHES",0]
[null,1207,39,"DELIGNE","Jeanne","BF1","DE PISAN","PERTHES",0]
[null,726,40,"BELOTTI","Georgia","BF1","CH PEGUY","VERNEUIL",0]
[null,3903,41,"MINEIRO","Mathilde","BF1","R BONHEUR","LE CHATELET",0]
[null,932,42,"MANGLOU","Camille","BF1","CHOPIN","MELUN",0]
[null,34,43,"TRAORE","Kangne","BF1","BROSSOLETTE","MELUN",0]
[null,937,44,"KHELOUFI","Amel","BF1","CHOPIN","MELUN",0]
[null,2451,45,"FAURE","Karla","BF1","J AMYOT","MELUN",0]
[null,3904,46,"TASSERY","Juliette","BF1","R BONHEUR","LE CHATELET",0]
[null,3930,47,"COURBET","LUCIE","MF","R BONHEUR","LE CHATELET",0]
[null,1206,48,"MAXIMINO MARQUES","Alexia","BF1","DE PISAN","PERTHES",0]
[null,734,49,"PLANQUETTE","Lisa","BF1","CH PEGUY","VERNEUIL",0]
[null,38,50,"BERKACHE","Thayri","BF1","BROSSOLETTE","MELUN",0]
[null,2717,51,"SANTIAGO","lois","BF1","J D'ARC","MELUN",0]
[null,741,52,"TCHAMBA NYA","Maelys","BF1","CH PEGUY","VERNEUIL",0]
[null,319,53,"AHMED","Antoine","BG1","CAPUCINS","MELUN",0]
[null,1865,54,"BELBAGRA","Chaïma","BF1","ELSA TRIOLET","LE MEE",0]
[null,961,55,"GALLEBY ","Cloé","BF2","CHOPIN","MELUN",0]
[null,36,56,"SOUNGA","Cheryl","BF1","BROSSOLETTE","MELUN",0]
[null,736,57,"JUY","Marion","BF1","CH PEGUY","VERNEUIL",0]
[null,1884,58,"NOUGA NOUGA","Divine","BF1","ELSA TRIOLET","LE MEE",0]
[null,1869,59,"ROBERT","LéA","BF1","ELSA TRIOLET","LE MEE",0]
[null,1515,60,"SADOK-SALAH","Yousra","BF1","DOISNEAU","DAMMARIE",0]
[null,1870,61,"HEURTEAUX","Lydie","BF1","ELSA TRIOLET","LE MEE",0]
[null,1881,62,"EL HAFIDI","Salma","BF1","ELSA TRIOLET","LE MEE",0]
[null,1883,63,"OUALI","Chahinez","BF1","ELSA TRIOLET","LE MEE",0]
[null,44,64,"KHELOUFI ","Mariam","BF1","BROSSOLETTE","MELUN",0]
[null,1866,65,{"$f":"IF($B69=\"\",\"\",LOOKUP($B69,BASE,nom))","v":"SALABERT FEAT"},{"$f":"IF($B69=\"\",\"\",LOOKUP($B69,BASE,prenom))","v":"Tara"},{"$f":"IF($B69=\"\",\"\",LOOKUP($B69,BASE,cat))","v":"BF1"},{"$f":"IF($B69=\"\",\"\",LOOKUP($B69,BASE,etab))","v":"ELSA TRIOLET"},{"$f":"IF($B69=\"\",\"\",LOOKUP($B69,BASE,VILLE))","v":"LE MEE"},{"$f":"IF($B69=\"\",\"\",LOOKUP($B69,BASE,Num))","v":0}]
[null,1217,66,"CHAILLOU","Maude","BF1","DE PISAN","PERTHES",0]
[null,2705,67,"AIT ISSIMOUR","sofia","BF1","J D'ARC","MELUN",0]
[null,2718,68,"BANTEGNY","diane","BF1","J D'ARC","MELUN",0]
[null,31,69,"DIA","Djeïnaba","BF1","BROSSOLETTE","MELUN",0]
[null,39,70,"KARTAL","Meryem","BF1","BROSSOLETTE","MELUN",0]
[null,2707,71,"TARAUD","manon","BF1","J D'ARC","MELUN",0]
[null,2736,72,"BICICI","dilber","BF1","J D'ARC","MELUN",0]
[null,2734,73,"MUNGALA","harmonie","BF1","J D'ARC","MELUN",0]
[null,988,74,"MOUNA ","Jessy","BF1","CHOPIN","MELUN",0]
[null,1885,75,"ABRAHAM","Iswaree","BF1","ELSA TRIOLET","LE MEE",0]
[null,312,76,"NIZAR","Youness","MG","CAPUCINS","MELUN",0]
[null,3002,77,"SAMBA","Aymey Sarah","BF1","LA FONTAINE","LE MEE",0]
[null,41,78,"EL ABIDI","Ibtissem","BF1","BROSSOLETTE","MELUN",0]
[null,3613,79,"AÏT-MOHAND","Wissal","BF1","NAZARETH","VOISENON",0]
[null,1526,80,"BERGER","Lauren","BF1","DOISNEAU","DAMMARIE",0]
[null,1001,81,"YESILBAS","Rumeysa","BF1","CHOPIN","MELUN",0]
[null,971,82,"KINKUNDA ","Charlene","BF1","CHOPIN","MELUN",0]
[null,942,83,"ADEBAYO Modupé\n\n","Modupé","BF1","CHOPIN","MELUN",0]
[null,3001,84,"SAMBA","Aymey Rachel","BF1","LA FONTAINE","LE MEE",0]
[null,3009,85,"BATCHAKOUI","Keyana","BF1","LA FONTAINE","LE MEE",0]
[null,3614,86,"DELEFORTERIE","Doreen","BF1","NAZARETH","VOISENON",0]
[null,2727,87,"VERGER","auriane","BF1","J D'ARC","MELUN",0]
[null,null,88,"","","","","",""]
[null,null,89,"","","","","",""]
[null,null,90,"","","","","",""]
[null,null,91,"","","","","",""]
[null,null,92,"","","","","",""]
[null,null,93,"","","","","",""]
[null,null,94,"","","","","",""]
[null,null,95,"","","","","",""]
[null,null,96,"","","","","",""]
[null,null,97,"","","","","",""]
[null,null,98,"","","","","",""]
[null,null,99,"","","","","",""]
[null,null,100,"","","","","",""]
[null,null,101,"","","","","",""]
[null,null,102,"","","","","",""]
[null,null,103,"","","","","",""]
[null,null,104,"","","","","",""]
[null,null,105,"","","","","",""]
[null,null,106,"","","","","",""]
[null,null,107,"","","","","",""]
[null,null,108,"","","","","",""]
[null,null,109,"","","","","",""]
[null,null,110,"","","","","",""]
[null,null,111,"","","","","",""]
[null,null,112,"","","","","",""]
[null,null,113,"","","","","",""]
[null,null,114,"","","","",""]
[null,null,115,"","","","","",""]
[null,null,116,"","","","","",""]
[null,null,117,"","","","","",""]
[null,null,118,"","","","","",""]
[null,null,119,"","","","","",""]
[null,null,120,"","","","","",""]
[null,null,121,"","","","","",""]
[null,null,122,"","","","","",""]
[null,null,123,"","","","","",""]
[null,null,124,"","","","","",""]
[null,null,125,"","","","","",""]
[null,null,126,"","","","","",""]
[null,null,127,"","","","","",""]
[null,null,128,"","","","","",""]
[null,null,129,"","","","","",""]
[null,null,130,{"$f":"IF($B134=\"\",\"\",LOOKUP($B134,BASE,nom))","v":""},{"$f":"IF($B134=\"\",\"\",LOOKUP($B134,BASE,prenom))","v":""},{"$f":"IF($B134=\"\",\"\",LOOKUP($B134,BASE,cat))","v":""},{"$f":"IF($B134=\"\",\"\",LOOKUP($B134,BASE,etab))","v":""},{"$f":"IF($B134=\"\",\"\",LOOKUP($B134,BASE,VILLE))","v":""},{"$f":"IF($B134=\"\",\"\",LOOKUP($B134,BASE,Num))","v":""}]
[null,null,131,"","","","","",""]
[null,null,132,"","","","","",""]
[null,null,133,"","","","","",""]
[null,null,134,"","","","","",""]
[null,null,135,"","","","","",""]
[null,null,136,"","","","","",""]
[null,null,137,"","","","","",""]
[null,null,138,"","","","","",""]
[null,null,139,"","","","","",""]
[null,null,140,"","","","","",""]
[null,null,141,"","","","","",""]
[null,null,142,"","","","","",""]
[null,null,143,"","","","","",""]
[null,null,144,"","","","","",""]
[null,null,145,"","","","","",""]
[null,null,146,"","","","","",""]
[null,null,147,"","","","","",""]
[null,null,148,"","","","","",""]
[null,null,149,"","","","","",""]
[null,null,150,"","","","","",""]
[null,null,151,"","","","","",""]
[null,null,152,"","","","","",""]
[null,null,153,"","","","","",""]
[null,null,154,"","","","","",""]
[null,null,155,"","","","","",""]
[null,null,156,"","","","","",""]
[null,null,157,"","","","","",""]
[null,null,158,"","","","","",""]
[null,null,159,"","","","","",""]
[null,null,160,"","","","","",""]
[null,null,161,"","","","","",""]
[null,null,162,"","","","","",""]
[null,null,163,"","","","","",""]
[null,null,164,"","","","","",""]
[null,null,165,"","","","","",""]
[null,null,166,"","","","","",""]
[null,null,167,"","","","","",""]
[null,null,168,"","","","","",""]
[null,null,169,"","","","","",""]
[null,null,170,"","","","","",""]
[null,null,171,"","","","","",""]
[null,null,172,"","","","","",""]
[null,null,173,"","","","","",""]
[null,null,174,"","","","","",""]
[null,null,175,"","","","","",""]
[null,null,176,"","","","","",""]
[null,null,177,"","","","","",""]
[null,null,178,"","","","","",""]
[null,null,179,"","","","","",""]
[null,null,180,"","","","","",""]
[null,null,181,"","","","","",""]
[null,null,182,"","","","","",""]
[null,null,183,"","","","","",""]
[null,null,184,"","","","","",""]
[null,null,185,"","","","","",""]
[null,null,186,"","","","","",""]
[null,null,187,"","","","","",""]
[null,null,188,"","","","","",""]
[null,null,189,"","","","","",""]
[null,null,190,"","","","","",""]
[null,null,191,"","","","","",""]
[null,null,192,"","","","","",""]
[null,null,193,"","","","","",""]
[null,null,194,{"$f":"IF($B198=\"\",\"\",LOOKUP($B198,BASE,nom))","v":""},{"$f":"IF($B198=\"\",\"\",LOOKUP($B198,BASE,prenom))","v":""},{"$f":"IF($B198=\"\",\"\",LOOKUP($B198,BASE,cat))","v":""},{"$f":"IF($B198=\"\",\"\",LOOKUP($B198,BASE,etab))","v":""},{"$f":"IF($B198=\"\",\"\",LOOKUP($B198,BASE,VILLE))","v":""},{"$f":"IF($B198=\"\",\"\",LOOKUP($B198,BASE,Num))","v":""}]
[null,null,195,"","","","","",""]
[null,null,196,"","","","","",""]
[null,null,197,"","","","","",""]
[null,null,198,"","","","","",""]
[null,null,199,"","","","","",""]
[null,null,200,"","","","","",""]
[null,null,201,"","","","","",""]
[null,null,202,"","","","","",""]
[null,null,203,"","","","","",""]
[null,null,204,"","","","","",""]
[null,null,205,"","","","","",""]
[null,null,206,"","","","","",""]
[null,null,207,"","","","","",""]
[null,null,208,"","","","","",""]
[null,null,209,"","","","","",""]
[null,null,210,"","","","","",""]
[null,null,211,"","","","","",""]
[null,null,212,"","","","","",""]
[null,null,213,"","","","","",""]
[null,null,214,"","","","","",""]
[null,null,215,"","","","","",""]
[null,null,216,"","","","","",""]
[null,null,217,"","","","","",""]
[null,null,218,"","","","","",""]
[null,null,219,"","","","","",""]
[null,null,220,"","","","","",""]
[null,null,221,"","","","","",""]
[null,null,222,"","","","","",""]
[null,null,223,"","","","","",""]
[null,null,224,"","","","","",""]
[null,null,225,"","","","","",""]
[null,null,226,"","","","","",""]
[null,null,227,"","","","","",""]
[null,null,228,"","","","","",""]
[null,null,229,"","","","","",""]
[null,null,230,"","","","","",""]
[null,null,231,"","","","","",""]
[null,null,232,"","","","","",""]
[null,null,233,"","","","","",""]
[null,null,234,"","","","","",""]
[null,null,235,"","","","","",""]
[null,null,236,"","","","","",""]
[null,null,237,"","","","","",""]
[null,null,238,"","","","","",""]
[null,null,239,"","","","","",""]
[null,null,240,"","","","","",""]
[null,null,241,"","","","","",""]
[null,null,242,"","","","","",""]
[null,null,243,"","","","","",""]
[null,null,244,"","","","","",""]
[null,null,245,"","","","","",""]
[null,null,246,"","","","","",""]
[null,null,247,"","","","","",""]
[null,null,248,"","","","","",""]
[null,null,249,"","","","","",""]
[null,null,250,"","","","","",""]
[null,null,251,"","","","","",""]
[null,null,252,"","","","","",""]
[null,null,253,"","","","","",""]
[null,null,254,"","","","","",""]
[null,null,255,"","","","","",""]
[null,null,256,"","","","","",""]
[null,null,257,"","","","","",""]
[null,null,258,{"$f":"IF($B262=\"\",\"\",LOOKUP($B262,BASE,nom))","v":""},{"$f":"IF($B262=\"\",\"\",LOOKUP($B262,BASE,prenom))","v":""},{"$f":"IF($B262=\"\",\"\",LOOKUP($B262,BASE,cat))","v":""},{"$f":"IF($B262=\"\",\"\",LOOKUP($B262,BASE,etab))","v":""},{"$f":"IF($B262=\"\",\"\",LOOKUP($B262,BASE,VILLE))","v":""},{"$f":"IF($B262=\"\",\"\",LOOKUP($B262,BASE,Num))","v":""}]
[null,null,259,"","","","","",""]
[null,null,260,"","","","","",""]
[null,null,261,"","","","","",""]
[null,null,262,"","","","","",""]
[null,null,263,"","","","","",""]
[null,null,264,"","","","","",""]
[null,null,265,"","","","","",""]
[null,null,266,"","","","","",""]
[null,null,267,"","","","","",""]
[null,null,268,"","","","","",""]
[null,null,269,"","","","","",""]
[null,null,270,"","","","","",""]
[null,null,271,"","","","","",""]
[null,null,272,"","","","","",""]
[null,null,273,"","","","","",""]
[null,null,274,"","","","","",""]
[null,null,275,"","","","","",""]
[null,null,276,"","","","","",""]
[null,null,277,"","","","","",""]
[null,null,278,"","","","","",""]
[null,null,279,"","","","","",""]
[null,null,280,"","","","","",""]
[null,null,281,"","","","","",""]

{"sheet":"Classt BF 2","index":4,"n_rows":285,"n_cols":12,"rows_kept":285,"cut":false,"hidden":false,"merged":[[1,1,1,8]]}
[]
[null,"CROSS DU DISTRICT\nBENJAMINES CLASSEMENT SCRATCH"]
[]
[null,"Dossard","PLACES","NOMS","PRENOMS","CATE","ETABLISSEMENT","VILLE","N°"]
[null,3908,1,{"$f":"IF($B5=\"\",\"\",LOOKUP($B5,BASE,nom))","v":"PEREIRA CARVALHO"},{"$f":"IF($B5=\"\",\"\",LOOKUP($B5,BASE,prenom))","v":"Anaïs"},{"$f":"IF($B5=\"\",\"\",LOOKUP($B5,BASE,cat))","v":"BF2"},{"$f":"IF($B5=\"\",\"\",LOOKUP($B5,BASE,etab))","v":"R BONHEUR"},{"$f":"IF($B5=\"\",\"\",LOOKUP($B5,BASE,VILLE))","v":"LE CHATELET"},{"$f":"IF($B5=\"\",\"\",LOOKUP($B5,BASE,Num))","v":0}]
[null,3333,2,"BEALOU","Calista","BF2","LA MARE AUX CHAMPS","VAUX",0]
[null,679,3,"PHILIPPE","Clara","BF2","CH PEGUY","VERNEUIL",0]
[null,684,4,"TILLARD","Aude","BF2","CH PEGUY","VERNEUIL",0]
[null,3331,5,"COLSON","Aude","BF2","LA MARE AUX CHAMPS","VAUX",0]
[null,46,6,"MOUNGABIO","Ornella","BF2","BROSSOLETTE","MELUN",0]
[null,3332,7,"COLSON","Noemie","BF2","LA MARE AUX CHAMPS","VAUX",0]
[null,1201,8,"BACH","Elisa","BF1","DE PISAN","PERTHES",0]
[null,680,9,"LIGNAC","Juliette","BF2","CH PEGUY","VERNEUIL",0]
[null,683,10,"GEOFFROY","Ambre","BF2","CH PEGUY","VERNEUIL",0]
[null,681,11,"LABAILLE","Cloé","BF2","CH PEGUY","VERNEUIL",0]
[null,1243,12,"LEMAIRE","Célia","BF2","DE PISAN","PERTHES",0]
[null,1241,13,"BONNET","Alexandra","BF2","DE PISAN","PERTHES",0]
[null,685,14,"KAVUESO","Lorena","BF2","CH PEGUY","VERNEUIL",0]
[null,682,15,"DELALANDE","Charline","BF2","CH PEGUY","VERNEUIL",0]
[null,1244,16,"LEMEE","Aurore","BF2","DE PISAN","PERTHES",0]
[null,2103,17,"BLOT","Axelle","BF2","F VILLON","PONTHIERRY",0]
[null,678,18,"MARQUES","Cassandra","BF2","CH PEGUY","VERNEUIL",0]
[null,327,19,"TUTU MAYANGILA","Ryan","BG1","CAPUCINS","MELUN",0]
[null,692,20,"JOVE","Emily","BF2","CH PEGUY","VERNEUIL",0]
[null,687,21,"TILLARD","Emma","BF2","CH PEGUY","VERNEUIL",0]
[null,2438,22,"DAS SANTOS","Marylou","BF2","J AMYOT","MELUN",0]
[null,3910,23,"SARREY","Anaïs","BF2","R BONHEUR","LE CHATELET",0]
[null,699,24,"REMACLE","LISA","BF2","CH PEGUY","VERNEUIL",0]
[null,3621,25,"PICOT","Loane","BF2","NAZARETH","VOISENON",0]
[null,1531,26,"BERAUD","Luna","BF2","DOISNEAU","DAMMARIE",0]
[null,47,27,"MEKHACHENE","Wassila","BF2","BROSSOLETTE","MELUN",0]
[null,1843,28,"EL MAZIANI","Sabrina","BF2","ELSA TRIOLET","LE MEE",0]
[null,690,29,"BELARBI","Hazar-Zakia","BF2","CH PEGUY","VERNEUIL",0]
[null,1844,30,"GUILLOCHON","Imane","BF2","ELSA TRIOLET","LE MEE",0]
[null,3335,31,"DJEBAR","Cassandra","BF2","LA MARE AUX CHAMPS","VAUX",0]
[null,686,32,"SEJOR-PRINET","Paloma","BF2","CH PEGUY","VERNEUIL",0]
[null,302,33,"KAMARA","N'Mah","BF1","CAPUCINS","MELUN",0]
[null,3341,34,"TRIQUET","Clara","BF2","LA MARE AUX CHAMPS","VAUX",0,null,null,"  "]
[null,50,35,"YANDOKOUZOU","Audrey","BF2","BROSSOLETTE","MELUN",0]
[null,57,36,"AUGUSTO","Camille","BF2","BROSSOLETTE","MELUN",0]
[null,58,37,"THOMIAS","Céliane","BF2","BROSSOLETTE","MELUN",0]
[null,3915,38,"BOURGAULT","Marie","BF2","R BONHEUR","LE CHATELET",0]
[null,1247,39,"BAUJARD","Léa","BF2","DE PISAN","PERTHES",0]
[null,3935,40,"RELOUZAT","CANDICE","BF2","R BONHEUR","LE CHATELET",0]
[null,1248,41,"MAUGAIN","Léonie","BF2","DE PISAN","PERTHES",0]
[null,54,42,"SYMPHOR","Lana","BF2","BROSSOLETTE","MELUN",0]
[null,1525,43,"ABUBAKAR","Zakiya","BF2","DOISNEAU","DAMMARIE",0]
[null,53,44,"SISSOKO","Aissetou","BF2","BROSSOLETTE","MELUN",0]
[null,635,45,"VERNOIS","Nina","BF2","CH PEGUY","VERNEUIL",0]
[null,1530,46,"NOEL","Emmeline","BF2","DOISNEAU","DAMMARIE",0]
[null,1527,47,"GOURNAY","Valentine","BF2","DOISNEAU","DAMMARIE",0]
[null,697,48,"VIEIRA","Abigaelle","BF2","CH PEGUY","VERNEUIL",0]
[null,3309,49,"DE SOUSA","Lucia","BF2","LA MARE AUX CHAMPS","VAUX",0]
[null,691,50,"CHATELAIS","Maëlle","BF2","CH PEGUY","VERNEUIL",0]
[null,1847,51,"NSONGO","Lysa","BF2","ELSA TRIOLET","LE MEE",0]
[null,61,52,"KABEYA MBUYI","Angèle","BF2","BROSSOLETTE","MELUN",0]
[null,1841,53,"ATTIK","Sarah","BF2","ELSA TRIOLET","LE MEE",0]
[null,1848,54,"MANZOLO MOSEKA","Sonia","BF2","ELSA TRIOLET","LE MEE",0]
[null,3909,55,"GREFFE","Léa","BF2","R BONHEUR","LE CHATELET",0]
[null,56,56,"GUERRY","Ness","BF2","BROSSOLETTE","MELUN",0]
[null,1365,57,"POTIER","Lyzéa","BF2","DE PISAN","PERTHES",0]
[null,52,58,"BATSIMBA","Julie","BF2","BROSSOLETTE","MELUN",0]
[null,55,59,"CONDE","Mama ","BF2","BROSSOLETTE","MELUN",0]
[null,49,60,"YILDIZ","Berivan","BF2","BROSSOLETTE","MELUN",0]
[null,59,61,"DESZELUS","Camille","BF2","BROSSOLETTE","MELUN",0]
[null,935,62,"SISSOKO","Soussaba","BF2","CHOPIN","MELUN",0]
[null,3005,63,"COULIBALY","Assya","BF2","LA FONTAINE","LE MEE",0]
[null,null,64,"","","","","",""]
[null,null,65,{"$f":"IF($B69=\"\",\"\",LOOKUP($B69,BASE,nom))","v":""},{"$f":"IF($B69=\"\",\"\",LOOKUP($B69,BASE,prenom))","v":""},{"$f":"IF($B69=\"\",\"\",LOOKUP($B69,BASE,cat))","v":""},{"$f":"IF($B69=\"\",\"\",LOOKUP($B69,BASE,etab))","v":""},{"$f":"IF($B69=\"\",\"\",LOOKUP($B69,BASE,VILLE))","v":""},{"$f":"IF($B69=\"\",\"\",LOOKUP($B69,BASE,Num))","v":""}]
[null,null,66,"","","","","",""]
[null,null,67,"","","","","",""]
[null,null,68,"","","","","",""]
[null,null,69,"","","","","",""]
[null,null,70,"","","","","",""]
[null,null,71,"","","","","",""]
[null,null,72,"","","","","",""]
[null,null,73,"","","","","",""]
[null,null,74,"","","","","",""]
[null,null,75,"","","","","",""]
[null,null,76,"","","","","",""]
[null,null,77,"","","","","",""]
[null,null,78,"","","","","",""]
[null,null,79,"","","","","",""]
[null,null,80,"","","","","",""]
[null,null,81,"","","","","",""]
[null,null,82,"","","","","",""]
[null,null,83,"","","","","",""]
[null,null,84,"","","","","",""]
[null,null,85,"","","","","",""]
[null,null,86,"","","","","",""]
[null,null,87,"","","","","",""]
[null,null,88,"","","","","",""]
[null,null,89,"","","","","",""]
[null,null,90,"","","","","",""]
[null,null,91,"","","","","",""]
[null,null,92,"","","","","",""]
[null,null,93,"","","","","",""]
[null,null,94,"","","","","",""]
[null,null,95,"","","","","",""]
[null,null,96,"","","","","",""]
[null,null,97,"","","","","",""]
[null,null,98,"","","","","",""]
[null,null,99,"","","","","",""]
[null,null,100,"","","","","",""]
[null,null,101,"","","","","",""]
[null,null,102,"","","","","",""]
[null,null,103,"","","","","",""]
[null,null,104,"","","","","",""]
[null,null,105,"","","","","",""]
[null,null,106,"","","","","",""]
[null,null,107,"","","","","",""]
[null,null,108,"","","","","",""]
[null,null,109,"","","","","",""]
[null,null,110,"","","","","",""]
[null,null,111,"","","","","",""]
[null,null,112,"","","","","",""]
[null,null,113,"","","","","",""]
[null,null,114,"","","","",""]
[null,null,115,"","","","","",""]
[null,null,116,"","","","","",""]
[null,null,117,"","","","","",""]
[null,null,118,"","","","","",""]
[null,null,119,"","","","","",""]
[null,null,120,"","","","","",""]
[null,null,121,"","","","","",""]
[null,null,122,"","","","","",""]
[null,null,123,"","","","","",""]
[null,null,124,"","","","","",""]
[null,null,125,"","","","","",""]
[null,null,126,"","","","","",""]
[null,null,127,"","","","","",""]
[null,null,128,"","","","","",""]
[null,null,129,"","","","","",""]
[null,null,130,{"$f":"IF($B134=\"\",\"\",LOOKUP($B134,BASE,nom))","v":""},{"$f":"IF($B134=\"\",\"\",LOOKUP($B134,BASE,prenom))","v":""},{"$f":"IF($B134=\"\",\"\",LOOKUP($B134,BASE,cat))","v":""},{"$f":"IF($B134=\"\",\"\",LOOKUP($B134,BASE,etab))","v":""},{"$f":"IF($B134=\"\",\"\",LOOKUP($B134,BASE,VILLE))","v":""},{"$f":"IF($B134=\"\",\"\",LOOKUP($B134,BASE,Num))","v":""}]
[null,null,131,"","","","","",""]
[null,null,132,"","","","","",""]
[null,null,133,"","","","","",""]
[null,null,134,"","","","","",""]
[null,null,135,"","","","","",""]
[null,null,136,"","","","","",""]
[null,null,137,"","","","","",""]
[null,null,138,"","","","","",""]
[null,null,139,"","","","","",""]
[null,null,140,"","","","","",""]
[null,null,141,"","","","","",""]
[null,null,142,"","","","","",""]
[null,null,143,"","","","","",""]
[null,null,144,"","","","","",""]
[null,null,145,"","","","","",""]
[null,null,146,"","","","","",""]
[null,null,147,"","","","","",""]
[null,null,148,"","","","","",""]
[null,null,149,"","","","","",""]
[null,null,150,"","","","","",""]
[null,null,151,"","","","","",""]
[null,null,152,"","","","","",""]
[null,null,153,"","","","","",""]
[null,null,154,"","","","","",""]
[null,null,155,"","","","","",""]
[null,null,156,"","","","","",""]
[null,null,157,"","","","","",""]
[null,null,158,"","","","","",""]
[null,null,159,"","","","","",""]
[null,null,160,"","","","","",""]
[null,null,161,"","","","","",""]
[null,null,162,"","","","","",""]
[null,null,163,"","","","","",""]
[null,null,164,"","","","","",""]
[null,null,165,"","","","","",""]
[null,null,166,"","","","","",""]
[null,null,167,"","","","","",""]
[null,null,168,"","","","","",""]
[null,null,169,"","","","","",""]
[null,null,170,"","","","","",""]
[null,null,171,"","","","","",""]
[null,null,172,"","","","","",""]
[null,null,173,"","","","","",""]
[null,null,174,"","","","","",""]
[null,null,175,"","","","","",""]
[null,null,176,"","","","","",""]
[null,null,177,"","","","","",""]
[null,null,178,"","","","","",""]
[null,null,179,"","","","","",""]
[null,null,180,"","","","","",""]
[null,null,181,"","","","","",""]
[null,null,182,"","","","","",""]
[null,null,183,"","","","","",""]
[null,null,184,"","","","","",""]
[null,null,185,"","","","","",""]
[null,null,186,"","","","","",""]
[null,null,187,"","","","","",""]
[null,null,188,"","","","","",""]
[null,null,189,"","","","","",""]
[null,null,190,"","","","","",""]
[null,null,191,"","","","","",""]
[null,null,192,"","","","","",""]
[null,null,193,"","","","","",""]
[null,null,194,{"$f":"IF($B198=\"\",\"\",LOOKUP($B198,BASE,nom))","v":""},{"$f":"IF($B198=\"\",\"\",LOOKUP($B198,BASE,prenom))","v":""},{"$f":"IF($B198=\"\",\"\",LOOKUP($B198,BASE,cat))","v":""},{"$f":"IF($B198=\"\",\"\",LOOKUP($B198,BASE,etab))","v":""},{"$f":"IF($B198=\"\",\"\",LOOKUP($B198,BASE,VILLE))","v":""},{"$f":"IF($B198=\"\",\"\",LOOKUP($B198,BASE,Num))","v":""}]
[null,null,195,"","","","","",""]
[null,null,196,"","","","","",""]
[null,null,197,"","","","","",""]
[null,null,198,"","","","","",""]
[null,null,199,"","","","","",""]
[null,null,200,"","","","","",""]
[null,null,201,"","","","","",""]
[null,null,202,"","","","","",""]
[null,null,203,"","","","","",""]
[null,null,204,"","","","","",""]
[null,null,205,"","","","","",""]
[null,null,206,"","","","","",""]
[null,null,207,"","","","","",""]
[null,null,208,"","","","","",""]
[null,null,209,"","","","","",""]
[null,null,210,"","","","","",""]
[null,null,211,"","","","","",""]
[null,null,212,"","","","","",""]
[null,null,213,"","","","","",""]
[null,null,214,"","","","","",""]
[null,null,215,"","","","","",""]
[null,null,216,"","","","","",""]
[null,null,217,"","","","","",""]
[null,null,218,"","","","","",""]
[null,null,219,"","","","","",""]
[null,null,220,"","","","","",""]
[null,null,221,"","","","","",""]
[null,null,222,"","","","","",""]
[null,null,223,"","","","","",""]
[null,null,224,"","","","","",""]
[null,null,225,"","","","","",""]
[null,null,226,"","","","","",""]
[null,null,227,"","","","","",""]
[null,null,228,"","","","","",""]
[null,null,229,"","","","","",""]
[null,null,230,"","","","","",""]
[null,null,231,"","","","","",""]
[null,null,232,"","","","","",""]
[null,null,233,"","","","","",""]
[null,null,234,"","","","","",""]
[null,null,235,"","","","","",""]
[null,null,236,"","","","","",""]
[null,null,237,"","","","","",""]
[null,null,238,"","","","","",""]
[null,null,239,"","","","","",""]
[null,null,240,"","","","","",""]
[null,null,241,"","","","","",""]
[null,null,242,"","","","","",""]
[null,null,243,"","","","","",""]
[null,null,244,"","","","","",""]
[null,null,245,"","","","","",""]
[null,null,246,"","","","","",""]
[null,null,247,"","","","","",""]
[null,null,248,"","","","","",""]
[null,null,249,"","","","","",""]
[null,null,250,"","","","","",""]
[null,null,251,"","","","","",""]
[null,null,252,"","","","","",""]
[null,null,253,"","","","","",""]
[null,null,254,"","","","","",""]
[null,null,255,"","","","","",""]
[null,null,256,"","","","","",""]
[null,null,257,"","","","","",""]
[null,null,258,{"$f":"IF($B262=\"\",\"\",LOOKUP($B262,BASE,nom))","v":""},{"$f":"IF($B262=\"\",\"\",LOOKUP($B262,BASE,prenom))","v":""},{"$f":"IF($B262=\"\",\"\",LOOKUP($B262,BASE,cat))","v":""},{"$f":"IF($B262=\"\",\"\",LOOKUP($B262,BASE,etab))","v":""},{"$f":"IF($B262=\"\",\"\",LOOKUP($B262,BASE,VILLE))","v":""},{"$f":"IF($B262=\"\",\"\",LOOKUP($B262,BASE,Num))","v":""}]
[null,null,259,"","","","","",""]
[null,null,260,"","","","","",""]
[null,null,261,"","","","","",""]
[null,null,262,"","","","","",""]
[null,null,263,"","","","","",""]
[null,null,264,"","","","","",""]
[null,null,265,"","","","","",""]
[null,null,266,"","","","","",""]
[null,null,267,"","","","","",""]
[null,null,268,"","","","","",""]
[null,null,269,"","","","","",""]
[null,null,270,"","","","","",""]
[null,null,271,"","","","","",""]
[null,null,272,"","","","","",""]
[null,null,273,"","","","","",""]
[null,null,274,"","","","","",""]
[null,null,275,"","","","","",""]
[null,null,276,"","","","","",""]
[null,null,277,"","","","","",""]
[null,null,278,"","","","","",""]
[null,null,279,"","","","","",""]
[null,null,280,"","","","","",""]
[null,null,281,"","","","","",""]

{"sheet":"Classt Scratch BG","index":5,"n_rows":284,"n_cols":9,"rows_kept":284,"cut":false,"hidden":false,"merged":[[1,1,1,8]]}
[]
[null,"CROSS DU DISTRICT\nBENJAMINS CLASSEMENT SCRATCH"]
[]
[null,"Dossard","PLACES","NOMS","PRENOMS","CATE","ETABLISSEMENT","VILLE","N°"]
[null,1261,1,{"$f":"IF($B5=\"\",\"\",LOOKUP($B5,BASE,nom))","v":"IKUNGU BOMOLO"},{"$f":"IF($B5=\"\",\"\",LOOKUP($B5,BASE,prenom))","v":"Imâan"},{"$f":"IF($B5=\"\",\"\",LOOKUP($B5,BASE,cat))","v":"BG2"},{"$f":"IF($B5=\"\",\"\",LOOKUP($B5,BASE,etab))","v":"DE PISAN"},{"$f":"IF($B5=\"\",\"\",LOOKUP($B5,BASE,VILLE))","v":"PERTHES"},{"$f":"IF($B5=\"\",\"\",LOOKUP($B5,BASE,Num))","v":0}]
[null,1262,2,"GONTHIER","Kylian","BG2","DE PISAN","PERTHES",0]
[null,1521,3,"AISSANI","Yanis","BG2","DOISNEAU","DAMMARIE",0]
[null,2426,4,"CHAUSSE","Adrian","BG2","J AMYOT","MELUN",0]
[null,3344,5,"LARSONNEUR","Justin","BG1","LA MARE AUX CHAMPS","VAUX",0]
[null,16,6,"LOPES","Yohann","BG2","BROSSOLETTE","MELUN",0]
[null,2456,7,"PAWLIK","Benoit","BG1","J AMYOT","MELUN",0]
[null,18,8,"BAGBEMA","Zoumana","BG2","BROSSOLETTE","MELUN",0]
[null,2724,9,"WANSTER","alexis","BG2","J D'ARC","MELUN",0]
[null,921,10,"MEBTOUL","Samir","BG2","CHOPIN","MELUN",0]
[null,1221,11,"LAMARE","Nicolas","BG1","DE PISAN","PERTHES",0]
[null,923,12,"TEKA MAYALU","Ryan","BG2","CHOPIN","MELUN",0]
[null,2720,13,"LUKOMBO","nathan","BG1","J D'ARC","MELUN",0]
[null,1266,14,"COLONNA","Adrien Dorius","BG2","DE PISAN","PERTHES",0]
[null,1267,15,"SYLVAIN","Julien","BG2","DE PISAN","PERTHES",0]
[null,304,16,"MUNTU WA MUNGU","Vimoj","BG2","CAPUCINS","MELUN",0]
[null,1263,17,"INCANDELA","Baptiste","BG2","DE PISAN","PERTHES",0]
[null,3343,18,"BAVOL","Joan","BG2","LA MARE AUX CHAMPS","VAUX",0]
[null,2737,19,"DOUTRELON","jules","BG1","J D'ARC","MELUN",0]
[null,2106,20,"KUNZALA","Benjamin","BG2","F VILLON","PONTHIERRY",0]
[null,21,21,"MOHAMED","Akim","BG2","BROSSOLETTE","MELUN",0]
[null,3302,22,"SANSON","Malo","BG2","LA MARE AUX CHAMPS","VAUX",0]
[null,25,23,"DIPEIN","Calvin","BG2","BROSSOLETTE","MELUN",0]
[null,1269,24,"CABEZAS EGEA","Amaury","BG2","DE PISAN","PERTHES",0]
[null,700,25,"OBRIOT","Enzo","BG2","CH PEGUY","VERNEUIL",0]
[null,1268,26,"MIALET","Antoine","BG2","DE PISAN","PERTHES",0]
[null,924,27,"BENALI","Riad-Mohamed","BG2","CHOPIN","MELUN",0]
[null,704,28,"CANTAREL","Emilio","BG2","CH PEGUY","VERNEUIL",0]
[null,925,29,"FRIGUI","Ahmed","BG1","CHOPIN","MELUN",0]
[null,1224,30,"PESTAT","Tilouan","BG1","DE PISAN","PERTHES",0]
[null,3326,31,"KIBWATIAKA","Kilian","BG1","LA MARE AUX CHAMPS","VAUX",0]
[null,1859,32,"ISMAEL","Belaid","BG2","ELSA TRIOLET","LE MEE",0]
[null,742,33,"BELLO","Romain","BG1","CH PEGUY","VERNEUIL",0]
[null,22,34,"HAMMANI","Ilyess","BG2","BROSSOLETTE","MELUN",0]
[null,3310,35,"BRICOUT","Amélien","BG2","LA MARE AUX CHAMPS","VAUX",0]
[null,2739,36,"PRADO","martin","BG1","J D'ARC","MELUN",0]
[null,3603,37,"SURENA","Louis","BG1","NAZARETH","VOISENON",0]
[null,1857,38,"DOS SANTOS","Raphaël","BG2","ELSA TRIOLET","LE MEE",0]
[null,1873,39,"HANDALA","Adam","BG2","ELSA TRIOLET","LE MEE",0]
[null,2107,40,"BRUIANT","Antonin","BG2","F VILLON","PONTHIERRY",0]
[null,3911,41,"BOMBAY KOY","Jason","BG2","R BONHEUR","LE CHATELET",0]
[null,2108,42,"VEILLARD","Quentin","BG2","F VILLON","PONTHIERRY",0]
[null,7,43,"KIYINDO","Yvan","BG1","BROSSOLETTE","MELUN",0]
[null,710,44,"GAULARD","Clément","BG2","CH PEGUY","VERNEUIL",0]
[null,1510,45,"AIT EL MAALEM","Yliass","BG1","DOISNEAU","DAMMARIE",0]
[null,305,46,"SOULEIMANOV","Akraman","MG","CAPUCINS","MELUN",0]
[null,307,47,"LIMA SANCAO","Schilo","BG2","CAPUCINS","MELUN",0]
[null,1872,48,"DUCROTOY","Tristan","BG1","ELSA TRIOLET","LE MEE",0]
[null,3,49,"KOUKABA","Yanis","BG1","BROSSOLETTE","MELUN",0]
[null,1,50,"NSEKE","Gaël","BG1","BROSSOLETTE","MELUN",0]
[null,21,51,"MOHAMED","Akim","BG2","BROSSOLETTE","MELUN",0]
[null,926,52,"CAKAN","Adar","BG2","CHOPIN","MELUN",0]
[null,321,53,"ARSLAN","Orkun","BG1","CAPUCINS","MELUN",0]
[null,14,54,"TEMIROV","Malik","BG1","BROSSOLETTE","MELUN",0]
[null,756,55,"LEMAIRE","Enzo","BG1","CH PEGUY","VERNEUIL",0]
[null,743,56,"DE SOUSA BORGES","Nathan","BG1","CH PEGUY","VERNEUIL",0]
[null,1874,57,"HIMMER","Sherydan","BG1","ELSA TRIOLET","LE MEE",0]
[null,706,58,"SIMON","Titouan","BG2","CH PEGUY","VERNEUIL",0]
[null,2704,59,"BENKAIDA ","yanis","BG1","J D'ARC","MELUN",0]
[null,2714,60,"BAGUIDY","samuel","BG1","J D'ARC","MELUN",0]
[null,null,61,"GIRARD","Maxime","BG1","DE PISAN","PERTHES",""]
[null,702,62,"DUSSUEL","Bastien","BG2","CH PEGUY","VERNEUIL",0]
[null,1501,63,"PAWLIK","Clément","BG1","DOISNEAU","DAMMARIE",0]
[null,3611,64,"BILLIET","Baptiste","BG1","NAZARETH","VOISENON",0]
[null,3906,65,{"$f":"IF($B69=\"\",\"\",LOOKUP($B69,BASE,nom))","v":"VIGNEAU"},{"$f":"IF($B69=\"\",\"\",LOOKUP($B69,BASE,prenom))","v":"Erwan"},{"$f":"IF($B69=\"\",\"\",LOOKUP($B69,BASE,cat))","v":"BG1"},{"$f":"IF($B69=\"\",\"\",LOOKUP($B69,BASE,etab))","v":"R BONHEUR"},{"$f":"IF($B69=\"\",\"\",LOOKUP($B69,BASE,VILLE))","v":"LE CHATELET"},{"$f":"IF($B69=\"\",\"\",LOOKUP($B69,BASE,Num))","v":0}]
[null,3604,66,"BRULE","Titouan","BG1","NAZARETH","VOISENON",0]
[null,744,67,"DELALANDE","Gabriel","BG1","CH PEGUY","VERNEUIL",0]
[null,750,68,"EL-KRID","Issam","BG1","CH PEGUY","VERNEUIL",0]
[null,748,69,"MONGE","Xavier","BG1","CH PEGUY","VERNEUIL",0]
[null,1871,70,"LOUGBEGNON","Marvin","BG1","ELSA TRIOLET","LE MEE",0]
[null,1875,71,"PEREGUDOV","Steven","BG2","ELSA TRIOLET","LE MEE",0]
[null,10,72,"NOKO LAND","Horlan","BG1","BROSSOLETTE","MELUN",0]
[null,2715,73,"REYMOND","alexandre","BG2","J D'ARC","MELUN",0]
[null,1228,74,"MILLOT","Lancelot","BG1","DE PISAN","PERTHES",0]
[null,3905,75,"PACCHIANA ","Louis","BG1","R BONHEUR","LE CHATELET",0]
[null,2728,76,"PALUMBO","alexandre","BG1","J D'ARC","MELUN",0]
[null,3907,77,"GABRIEL","Allan","BG1","R BONHEUR","LE CHATELET",0]
[null,2738,78,"BENALI","ylies","BG1","J D'ARC","MELUN",0]
[null,3319,79,"CHAMDRYKOWSKA","Arthur","BG2","LA MARE AUX CHAMPS","VAUX",0]
[null,3327,80,"DELCROIX","Enzo","BG2","LA MARE AUX CHAMPS","VAUX",0]
[null,715,81,"BOISARD","Nicolas","BG2","CH PEGUY","VERNEUIL",0]
[null,28,82,"ASCOFARE","Djibril","BG2","BROSSOLETTE","MELUN",0]
[null,3928,83,"DORE","JASON","BG1","R BONHEUR","LE CHATELET",0]
[null,711,84,"JOYEZ","Robin","BG2","CH PEGUY","VERNEUIL",0]
[null,755,85,"THAMI","Manoa","BG1","CH PEGUY","VERNEUIL",0]
[null,20,86,"SIDIBE","Mamadou","BG2","BROSSOLETTE","MELUN",0]
[null,2467,87,"DRICI","MOUNIR","BG1","J AMYOT","MELUN",0]
[null,321,88,"ARSLAN","Orkun","BG1","CAPUCINS","MELUN",0]
[null,1877,89,"IVANCIU","Florin","BG1","ELSA TRIOLET","LE MEE",0]
[null,2,90,"SOUGMI","Badre","BG1","BROSSOLETTE","MELUN",0]
[null,1516,91,"RICOU","Mattéo","BG1","DOISNEAU","DAMMARIE",0]
[null,1237,92,"BAILAY","Eliott","BG1","DE PISAN","PERTHES",0]
[null,3301,93,"SIMONOT","Yann","BG2","LA MARE AUX CHAMPS","VAUX",0]
[null,1230,94,"BOLMIER","Mattéo","BG1","DE PISAN","PERTHES",0]
[null,753,95,"HAMMATI","Rayyane","BG1","CH PEGUY","VERNEUIL",0]
[null,3913,96,"AMBATE","Chris","BG2","R BONHEUR","LE CHATELET",0]
[null,2726,97,"CHAILLOT","paul","BG1","J D'ARC","MELUN",0]
[null,3912,98,"DUVERGT","Rémy","BG2","R BONHEUR","LE CHATELET",0]
[null,304,99,"MUNTU WA MUNGU","Vimoj","BG2","CAPUCINS","MELUN",0]
[null,1511,100,"LOLKI PAYENGI","Lemaiyan","BG1","DOISNEAU","DAMMARIE",0]
[null,3339,101,"JATTEAU","Simon","BG1","LA MARE AUX CHAMPS","VAUX",0]
[null,1236,102,"GILLET","Malvin","BG1","DE PISAN","PERTHES",0]
[null,1876,103,"GARAUD-RAKOTONIAINA","Enzo","BG1","ELSA TRIOLET","LE MEE",0]
[null,3616,104,"BOUEDO","Florian","BG1","NAZARETH","VOISENON",0]
[null,1235,105,"BOURGEOIS","Mathis","BG1","DE PISAN","PERTHES",0]
[null,327,106,"TUTU MAYANGILA","Ryan","BG1","CAPUCINS","MELUN",0]
[null,2465,107,"AISSAOUI","Marwane","BG1","J AMYOT","MELUN",0]
[null,746,108,"MARTINEZ","Téo","BG1","CH PEGUY","VERNEUIL",0]
[null,996,109,"SAMBAKE ","Bandiougou","BG1","CHOPIN","MELUN",0]
[null,718,110,"DESPREZ","Adrien","BG2","CH PEGUY","VERNEUIL",0]
[null,716,111,"LAUNAY","Mathéo","BG2","CH PEGUY","VERNEUIL",0]
[null,1232,112,"JOLY","Maxime","BG1","DE PISAN","PERTHES",0]
[null,12,113,"HAMDI","Yassine","BG1","BROSSOLETTE","MELUN",0]
[null,11,114,"LOPES BORGES","Killian","BG1","BROSSOLETTE","MELUN",0]
[null,750,115,"EL-KRID","Issam","BG1","CH PEGUY","VERNEUIL",0]
[null,2713,116,"KERNANET","victor","BG1","J D'ARC","MELUN",0]
[null,324,117,"BOULERY","Ethan","BG2","CAPUCINS","MELUN",0]
[null,3929,118,"HURTEAU","MAXIME","BG2","R BONHEUR","LE CHATELET",0]
[null,1513,119,"GUILBERT","Thibault","BG1","DOISNEAU","DAMMARIE",0]
[null,3608,120,"LEBOUAZOLA","Yanis","BG1","NAZARETH","VOISENON",0]
[null,310,121,"KHERBACHE","Bilal","BG2","CAPUCINS","MELUN",0]
[null,964,122,"HOCINE ","Yassine","BG1","CHOPIN","MELUN",0]
[null,318,123,"LELO","François","BG1","CAPUCINS","MELUN",0]
[null,318,124,"LELO","François","BG1","CAPUCINS","MELUN",0]
[null,1503,125,"GALLET","Bastien","BG1","DOISNEAU","DAMMARIE",0]
[null,761,126,"PELLARD","Alexandre","BG1","CH PEGUY","VERNEUIL",0]
[null,3317,127,"GALOPULO","Adam","BG2","LA MARE AUX CHAMPS","VAUX",0]
[null,1233,128,"MOITIE","Lysandre","BG1","DE PISAN","PERTHES",0]
[null,751,129,{"$f":"IF($B133=\"\",\"\",LOOKUP($B133,BASE,nom))","v":"BERGER"},{"$f":"IF($B133=\"\",\"\",LOOKUP($B133,BASE,prenom))","v":"Gregory"},{"$f":"IF($B133=\"\",\"\",LOOKUP($B133,BASE,cat))","v":"BG1"},{"$f":"IF($B133=\"\",\"\",LOOKUP($B133,BASE,etab))","v":"CH PEGUY"},{"$f":"IF($B133=\"\",\"\",LOOKUP($B133,BASE,VILLE))","v":"VERNEUIL"},{"$f":"IF($B133=\"\",\"\",LOOKUP($B133,BASE,Num))","v":0}]
[null,757,130,"VILLENEUVE","Alexis","BG1","CH PEGUY","VERNEUIL",0]
[null,1002,131,"YESILBAS ","Yousoufcan","BG2","CHOPIN","MELUN",0]
[null,3314,132,"MOITIE","Aléxis","BG1","LA MARE AUX CHAMPS","VAUX",0]
[null,1879,133,"N'SONGO","Yoan","BG1","ELSA TRIOLET","LE MEE",0]
[null,977,134,"LUMBNSUNGU ","Eden","BG2","CHOPIN","MELUN",0]
[null,999,135,"VERRES ","Clément","BG2","CHOPIN","MELUN",0]
[null,319,136,"AHMED","Antoine","BG1","CAPUCINS","MELUN",0]
[null,3612,137,"PAROLARI","Quentin","BG1","NAZARETH","VOISENON",0]
[null,3605,138,"DO NASCIMENTO","Pablo","BG1","NAZARETH","VOISENON",0]
[null,948,139,"BENCHABANE","Ilyess","BG1","CHOPIN","MELUN",0]
[null,759,140,"COQUELIN","Jeremy","BG1","CH PEGUY","VERNEUIL",0]
[null,1888,141,"POUGET","Quentin","BG1","ELSA TRIOLET","LE MEE",0]
[null,1886,142,"KATHIRAVELU","Hajeen","BG1","ELSA TRIOLET","LE MEE",0]
[null,992,143,"OUKASSOU ","Mohamed","BG2","CHOPIN","MELUN",0]
[null,2731,144,"LETORT","clément","BG1","J D'ARC","MELUN",0]
[null,2463,145,"BRIDJA","Abed","BG1","J AMYOT","MELUN",0]
[null,3617,146,"KADDOURI","Wassim","BG1","NAZARETH","VOISENON",0]
[null,758,147,"CORNANO","Mathias","BG1","CH PEGUY","VERNEUIL",0]
[null,2722,148,"POREE","kyllian","BG1","J D'ARC","MELUN",0]
[null,2740,149,"DELMAS","baptiste","BG1","J D'ARC","MELUN",0]
[null,949,150,"BENDJEBBOUR","Zakaria","BG2","CHOPIN","MELUN",0]
[null,943,151,"AITSALIH \n\n","Younes","BG1","CHOPIN","MELUN",0]
[null,3003,152,"BOURDIN","Tony","BG1","LA FONTAINE","LE MEE",0]
[null,966,153,"KACIMI ","Faresse","BG1","CHOPIN","MELUN",0]
[null,3004,154,"GUILLEMIN","Quentin","BG1","LA FONTAINE","LE MEE",0]
[null,950,155,"BENDJEBOUR ","Mehdi","BG1","CHOPIN","MELUN",0]
[null,982,156,"MIDEY ","Théo","BG1","CHOPIN","MELUN",0]
[null,2706,157,"TRINH","tristan","BG1","J D'ARC","MELUN",0]
[null,970,158,"KHAPIZOV ","Djabrail","BG2","CHOPIN","MELUN",0]
[null,956,159,"DURRWEL ","Rudy","BG2","CHOPIN","MELUN",0]
[null,984,160,"MNIA ","Firdaws","BG1","CHOPIN","MELUN",0]
[null,2710,161,"DUCHAMPS","romain","BG1","J D'ARC","MELUN",0]
[null,974,162,"LUCEA ","Menjy","BG2","CHOPIN","MELUN",0]
[null,null,163,"","","","","",""]
[null,null,164,"","","","","",""]
[null,null,165,"","","","","",""]
[null,null,166,"","","","","",""]
[null,null,167,"","","","","",""]
[null,null,168,"","","","","",""]
[null,null,169,"","","","","",""]
[null,null,170,"","","","","",""]
[null,null,171,"","","","","",""]
[null,null,172,"","","","","",""]
[null,null,173,"","","","","",""]
[null,null,174,"","","","","",""]
[null,null,175,"","","","","",""]
[null,null,176,"","","","","",""]
[null,null,177,"","","","","",""]
[null,null,178,"","","","","",""]
[null,null,179,"","","","","",""]
[null,null,180,"","","","","",""]
[null,null,181,"","","","","",""]
[null,null,182,"","","","","",""]
[null,null,183,"","","","","",""]
[null,null,184,"","","","","",""]
[null,null,185,"","","","","",""]
[null,null,186,"","","","","",""]
[null,null,187,"","","","","",""]
[null,null,188,"","","","","",""]
[null,null,189,"","","","","",""]
[null,null,190,"","","","","",""]
[null,null,191,"","","","","",""]
[null,null,192,{"$f":"IF($B196=\"\",\"\",LOOKUP($B196,BASE,nom))","v":""},{"$f":"IF($B196=\"\",\"\",LOOKUP($B196,BASE,prenom))","v":""},{"$f":"IF($B196=\"\",\"\",LOOKUP($B196,BASE,cat))","v":""},{"$f":"IF($B196=\"\",\"\",LOOKUP($B196,BASE,etab))","v":""},{"$f":"IF($B196=\"\",\"\",LOOKUP($B196,BASE,VILLE))","v":""},{"$f":"IF($B196=\"\",\"\",LOOKUP($B196,BASE,Num))","v":""}]
[null,null,193,{"$f":"IF($B197=\"\",\"\",LOOKUP($B197,BASE,nom))","v":""},{"$f":"IF($B197=\"\",\"\",LOOKUP($B197,BASE,prenom))","v":""},{"$f":"IF($B197=\"\",\"\",LOOKUP($B197,BASE,cat))","v":""},{"$f":"IF($B197=\"\",\"\",LOOKUP($B197,BASE,etab))","v":""},{"$f":"IF($B197=\"\",\"\",LOOKUP($B197,BASE,VILLE))","v":""},{"$f":"IF($B197=\"\",\"\",LOOKUP($B197,BASE,Num))","v":""}]
[null,null,194,"","","","","",""]
[null,null,195,"","","","","",""]
[null,null,196,"","","","","",""]
[null,null,197,"","","","","",""]
[null,null,198,"","","","","",""]
[null,null,199,"","","","","",""]
[null,null,200,"","","","","",""]
[null,null,201,"","","","","",""]
[null,null,202,"","","","","",""]
[null,null,203,"","","","","",""]
[null,null,204,"","","","","",""]
[null,null,205,"","","","","",""]
[null,null,206,"","","","","",""]
[null,null,207,"","","","","",""]
[null,null,208,"","","","","",""]
[null,null,209,"","","","","",""]
[null,null,210,"","","","","",""]
[null,null,211,"","","","","",""]
[null,null,212,"","","","","",""]
[null,null,213,"","","","","",""]
[null,null,214,"","","","","",""]
[null,null,215,"","","","","",""]
[null,null,216,"","","","","",""]
[null,null,217,"","","","","",""]
[null,null,218,"","","","","",""]
[null,null,219,"","","","","",""]
[null,null,220,"","","","","",""]
[null,null,221,"","","","","",""]
[null,null,222,"","","","","",""]
[null,null,223,"","","","","",""]
[null,null,224,"","","","","",""]
[null,null,225,{"$f":"IF($B229=\"\",\"\",LOOKUP($B229,BASE,nom))","v":""},{"$f":"IF($B229=\"\",\"\",LOOKUP($B229,BASE,prenom))","v":""},{"$f":"IF($B229=\"\",\"\",LOOKUP($B229,BASE,cat))","v":""},{"$f":"IF($B229=\"\",\"\",LOOKUP($B229,BASE,etab))","v":""},{"$f":"IF($B229=\"\",\"\",LOOKUP($B229,BASE,VILLE))","v":""},{"$f":"IF($B229=\"\",\"\",LOOKUP($B229,BASE,Num))","v":""}]
[null,null,226,"","","","","",""]
[null,null,227,"","","","","",""]
[null,null,228,"","","","","",""]
[null,null,229,"","","","","",""]
[null,null,230,"","","","","",""]
[null,null,231,"","","","","",""]
[null,null,232,"","","","","",""]
[null,null,233,"","","","","",""]
[null,null,234,"","","","","",""]
[null,null,235,"","","","","",""]
[null,null,236,"","","","","",""]
[null,null,237,"","","","","",""]
[null,null,238,"","","","","",""]
[null,null,239,"","","","","",""]
[null,null,240,"","","","","",""]
[null,null,241,"","","","","",""]
[null,null,242,"","","","","",""]
[null,null,243,"","","","","",""]
[null,null,244,"","","","","",""]
[null,null,245,"","","","","",""]
[null,null,246,"","","","","",""]
[null,null,247,"","","","","",""]
[null,null,248,"","","","","",""]
[null,null,249,"","","","","",""]
[null,null,250,"","","","","",""]
[null,null,251,"","","","","",""]
[null,null,252,"","","","","",""]
[null,null,253,"","","","","",""]
[null,null,254,"","","","","",""]
[null,null,255,"","","","","",""]
[null,null,256,"","","","","",""]
[null,null,257,{"$f":"IF($B261=\"\",\"\",LOOKUP($B261,BASE,nom))","v":""},{"$f":"IF($B261=\"\",\"\",LOOKUP($B261,BASE,prenom))","v":""},{"$f":"IF($B261=\"\",\"\",LOOKUP($B261,BASE,cat))","v":""},{"$f":"IF($B261=\"\",\"\",LOOKUP($B261,BASE,etab))","v":""},{"$f":"IF($B261=\"\",\"\",LOOKUP($B261,BASE,VILLE))","v":""},{"$f":"IF($B261=\"\",\"\",LOOKUP($B261,BASE,Num))","v":""}]
[null,null,258,"","","","","",""]
[null,null,259,"","","","","",""]
[null,null,260,"","","","","",""]
[null,null,261,"","","","","",""]
[null,null,262,"","","","","",""]
[null,null,263,"","","","","",""]
[null,null,264,"","","","","",""]
[null,null,265,"","","","","",""]
[null,null,266,"","","","","",""]
[null,null,267,"","","","","",""]
[null,null,268,"","","","","",""]
[null,null,269,"","","","","",""]
[null,null,270,"","","","","",""]
[null,null,271,"","","","","",""]
[null,null,272,"","","","","",""]
[null,null,273,"","","","","",""]
[null,null,274,"","","","","",""]
[null,null,275,"","","","","",""]
[null,null,276,"","","","","",""]
[null,null,277,"","","","","",""]
[null,null,278,"","","","","",""]
[null,null,279,"","","","","",""]
[null,null,280,"","","","","",""]

{"sheet":"Classt BG1","index":6,"n_rows":284,"n_cols":9,"rows_kept":284,"cut":false,"hidden":false,"merged":[[1,0,1,6]]}
[]
["CROSS DU DISTRICT\nCLASSEMENT BENJAMINS 1"]
[]
["PLACE","NOMS","PRENOMS","CATE","ETABLISSEMENT","VILLE","Num"]
[1,"LARSONNEUR","Justin","BG1","LA MARE AUX CHAMPS","VAUX",0,"",""]
[2,"PAWLIK","Benoit","BG1","J AMYOT","MELUN",0]
[3,"LAMARE","Nicolas","BG1","DE PISAN","PERTHES",0]
[4,"LUKOMBO","nathan","BG1","J D'ARC","MELUN",0]
[5,"DOUTRELON","jules","BG1","J D'ARC","MELUN",0]
[6,"FRIGUI","Ahmed","BG1","CHOPIN","MELUN",0]
[7,"PESTAT","Tilouan","BG1","DE PISAN","PERTHES",0]
[8,"KIBWATIAKA","Kilian","BG1","LA MARE AUX CHAMPS","VAUX",0]
[9,"BELLO","Romain","BG1","CH PEGUY","VERNEUIL",0]
[10,"PRADO","martin","BG1","J D'ARC","MELUN",0]
[11,"SURENA","Louis","BG1","NAZARETH","VOISENON",0]
[12,"KIYINDO","Yvan","BG1","BROSSOLETTE","MELUN",0]
[13,"AIT EL MAALEM","Yliass","BG1","DOISNEAU","DAMMARIE",0]
[14,"DUCROTOY","Tristan","BG1","ELSA TRIOLET","LE MEE",0]
[15,"KOUKABA","Yanis","BG1","BROSSOLETTE","MELUN",0]
[16,"NSEKE","Gaël","BG1","BROSSOLETTE","MELUN",0]
[17,"ARSLAN","Orkun","BG1","CAPUCINS","MELUN",0]
[18,"TEMIROV","Malik","BG1","BROSSOLETTE","MELUN",0]
[19,"LEMAIRE","Enzo","BG1","CH PEGUY","VERNEUIL",0]
[20,"DE SOUSA BORGES","Nathan","BG1","CH PEGUY","VERNEUIL",0]
[21,"HIMMER","Sherydan","BG1","ELSA TRIOLET","LE MEE",0]
[22,"BENKAIDA ","yanis","BG1","J D'ARC","MELUN",0]
[23,"BAGUIDY","samuel","BG1","J D'ARC","MELUN",0]
[24,"GIRARD","Maxime","BG1","DE PISAN","PERTHES",""]
[25,"PAWLIK","Clément","BG1","DOISNEAU","DAMMARIE",0]
[26,"BILLIET","Baptiste","BG1","NAZARETH","VOISENON",0]
[27,"VIGNEAU","Erwan","BG1","R BONHEUR","LE CHATELET",0]
[28,"BRULE","Titouan","BG1","NAZARETH","VOISENON",0]
[29,"DELALANDE","Gabriel","BG1","CH PEGUY","VERNEUIL",0]
[30,"EL-KRID","Issam","BG1","CH PEGUY","VERNEUIL",0]
[31,"MONGE","Xavier","BG1","CH PEGUY","VERNEUIL",0]
[32,"LOUGBEGNON","Marvin","BG1","ELSA TRIOLET","LE MEE",0]
[33,"NOKO LAND","Horlan","BG1","BROSSOLETTE","MELUN",0]
[34,"MILLOT","Lancelot","BG1","DE PISAN","PERTHES",0]
[35,"PACCHIANA ","Louis","BG1","R BONHEUR","LE CHATELET",0]
[36,"PALUMBO","alexandre","BG1","J D'ARC","MELUN",0]
[37,"GABRIEL","Allan","BG1","R BONHEUR","LE CHATELET",0]
[38,"BENALI","ylies","BG1","J D'ARC","MELUN",0]
[39,"DORE","JASON","BG1","R BONHEUR","LE CHATELET",0]
[40,"THAMI","Manoa","BG1","CH PEGUY","VERNEUIL",0]
[41,"DRICI","MOUNIR","BG1","J AMYOT","MELUN",0]
[42,"ARSLAN","Orkun","BG1","CAPUCINS","MELUN",0]
[43,"IVANCIU","Florin","BG1","ELSA TRIOLET","LE MEE",0]
[44,"SOUGMI","Badre","BG1","BROSSOLETTE","MELUN",0]
[45,"RICOU","Mattéo","BG1","DOISNEAU","DAMMARIE",0]
[46,"BAILAY","Eliott","BG1","DE PISAN","PERTHES",0]
[47,"BOLMIER","Mattéo","BG1","DE PISAN","PERTHES",0]
[48,"HAMMATI","Rayyane","BG1","CH PEGUY","VERNEUIL",0]
[49,"CHAILLOT","paul","BG1","J D'ARC","MELUN",0]
[50,"LOLKI PAYENGI","Lemaiyan","BG1","DOISNEAU","DAMMARIE",0]
[51,"JATTEAU","Simon","BG1","LA MARE AUX CHAMPS","VAUX",0]
[52,"GILLET","Malvin","BG1","DE PISAN","PERTHES",0]
[53,"GARAUD-RAKOTONIAINA","Enzo","BG1","ELSA TRIOLET","LE MEE",0]
[54,"BOUEDO","Florian","BG1","NAZARETH","VOISENON",0]
[55,"BOURGEOIS","Mathis","BG1","DE PISAN","PERTHES",0]
[56,"TUTU MAYANGILA","Ryan","BG1","CAPUCINS","MELUN",0]
[57,"AISSAOUI","Marwane","BG1","J AMYOT","MELUN",0]
[58,"MARTINEZ","Téo","BG1","CH PEGUY","VERNEUIL",0]
[59,"SAMBAKE ","Bandiougou","BG1","CHOPIN","MELUN",0]
[60,"JOLY","Maxime","BG1","DE PISAN","PERTHES",0]
[61,"HAMDI","Yassine","BG1","BROSSOLETTE","MELUN",0]
[62,"LOPES BORGES","Killian","BG1","BROSSOLETTE","MELUN",0]
[63,"EL-KRID","Issam","BG1","CH PEGUY","VERNEUIL",0]
[64,"KERNANET","victor","BG1","J D'ARC","MELUN",0]
[65,"GUILBERT","Thibault","BG1","DOISNEAU","DAMMARIE",0]
[66,"LEBOUAZOLA","Yanis","BG1","NAZARETH","VOISENON",0]
[67,"HOCINE ","Yassine","BG1","CHOPIN","MELUN",0]
[68,"LELO","François","BG1","CAPUCINS","MELUN",0]
[69,"LELO","François","BG1","CAPUCINS","MELUN",0]
[70,"GALLET","Bastien","BG1","DOISNEAU","DAMMARIE",0]
[71,"PELLARD","Alexandre","BG1","CH PEGUY","VERNEUIL",0]
[72,"MOITIE","Lysandre","BG1","DE PISAN","PERTHES",0]
[73,"BERGER","Gregory","BG1","CH PEGUY","VERNEUIL",0]
[74,"VILLENEUVE","Alexis","BG1","CH PEGUY","VERNEUIL",0]
[75,"MOITIE","Aléxis","BG1","LA MARE AUX CHAMPS","VAUX",0]
[76,"N'SONGO","Yoan","BG1","ELSA TRIOLET","LE MEE",0]
[77,"AHMED","Antoine","BG1","CAPUCINS","MELUN",0]
[78,"PAROLARI","Quentin","BG1","NAZARETH","VOISENON",0]
[79,"DO NASCIMENTO","Pablo","BG1","NAZARETH","VOISENON",0]
[80,"BENCHABANE","Ilyess","BG1","CHOPIN","MELUN",0]
[81,"COQUELIN","Jeremy","BG1","CH PEGUY","VERNEUIL",0]
[82,"POUGET","Quentin","BG1","ELSA TRIOLET","LE MEE",0]
[83,"KATHIRAVELU","Hajeen","BG1","ELSA TRIOLET","LE MEE",0]
[84,"LETORT","clément","BG1","J D'ARC","MELUN",0]
[85,"BRIDJA","Abed","BG1","J AMYOT","MELUN",0]
[86,"KADDOURI","Wassim","BG1","NAZARETH","VOISENON",0]
[87,"CORNANO","Mathias","BG1","CH PEGUY","VERNEUIL",0]
[88,"POREE","kyllian","BG1","J D'ARC","MELUN",0]
[89,"DELMAS","baptiste","BG1","J D'ARC","MELUN",0]
[90,"AITSALIH \n\n","Younes","BG1","CHOPIN","MELUN",0]
[91,"BOURDIN","Tony","BG1","LA FONTAINE","LE MEE",0]
[92,"KACIMI ","Faresse","BG1","CHOPIN","MELUN",0]
[93,"GUILLEMIN","Quentin","BG1","LA FONTAINE","LE MEE",0]
[94,"BENDJEBOUR ","Mehdi","BG1","CHOPIN","MELUN",0]
[95,"MIDEY ","Théo","BG1","CHOPIN","MELUN",0]
[96,"TRINH","tristan","BG1","J D'ARC","MELUN",0]
[97,"MNIA ","Firdaws","BG1","CHOPIN","MELUN",0]
[98,"DUCHAMPS","romain","BG1","J D'ARC","MELUN",0]
[99,"","","","","",""]
[100,"","","","","",""]
[101,"","","","","",""]
[102,"","","","","",""]
[103,"","","","","",""]
[104,"","","","","",""]
[105,"","","","","",""]
[106,"","","","","",""]
[107,"","","","","",""]
[108,"","","","","",""]
[109,"","","","","",""]
[110,"","","","","",""]
[111,"","","","","",""]
[112,"","","","","",""]
[113,"","","","","",""]
[114,"","","","","",""]
[115,"","","","","",""]
[116,"","","","","",""]
[117,"","","","","","",""]
[118,"","","","","","",""]
[119,"","","","","","",""]
[120,"","","","","","",""]
[121,"","","","","","",""]
[122,"","","","","","",""]
[123,"","","","","","",""]
[124,"","","","","","",""]
[125,"","","","","","",""]
[126,"","","","","","",""]
[127,"","","","","","",""]
[128,"","","","","","",""]
[129,"","","","","","",""]
[130,"","","","","","",""]
[131,"","","","","",""]
[132,"","","","","",""]
[133,"","","","","",""]
[134,"","","","","",""]
[135,"","","","","",""]
[136,"","","","","",""]
[137,"","","","","",""]
[138,"","","","","",""]
[139,"","","","","",""]
[140,"","","","","",""]
[141,"","","","","",""]
[142,"","","","","",""]
[143,"","","","","",""]
[144,"","","","","",""]
[145,"","","","","",""]
[146,"","","","","",""]
[147,"","","","","",""]
[148,"","","","","",""]
[149,"","","","","",""]
[150,"","","","","",""]
[151,"","","","","",""]
[152,"","","","","",""]
[153,"","","","","",""]
[154,"","","","","",""]
[155,"","","","","",""]
[156,"","","","","",""]
[157,"","","","","",""]
[158,"","","","","",""]
[159,"","","","","",""]
[160,"","","","","",""]
[161,"","","","","",""]
[162,"","","","","",""]
[163,"","","","","",""]
[164,"","","","","",""]
[165,"","","","","",""]
[166,"","","","","",""]
[167,"","","","","",""]
[168,"","","","","",""]
[169,"","","","","",""]
[170,"","","","","",""]
[171,"","","","","",""]
[172,"","","","","",""]
[173,"","","","","",""]
[174,"","","","","",""]
[175,"","","","","",""]
[176,"","","","","",""]
[177,"","","","","",""]
[178,"","","","","",""]
[179,"","","","","",""]
[180,"","","","","",""]
[181,"","","","","",""]
[182,"","","","","",""]
[183,"","","","","",""]
[184,"","","","","",""]
[185,"","","","","",""]
[186,"","","","","",""]
[187,"","","","","",""]
[188,"","","","","",""]
[189,"","","","","",""]
[190,"","","","","",""]
[191,"","","","","",""]
[192,"","","","","",""]
[193,"","","","","",""]
[194,"","","","","",""]
[195,"","","","","",""]
[196,"","","","","",""]
[197,"","","","","",""]
[198,"","","","","",""]
[199,"","","","","",""]
[200,"","","","","",""]
[201,"","","","","",""]
[202,"","","","","",""]
[203,"","","","","",""]
[204,"","","","","",""]
[205,"","","","","",""]
[206,"","","","","",""]
[207,"","","","","",""]
[208,"","","","","",""]
[209,"","","","","",""]
[210,"","","","","",""]
[211,"","","","","",""]
[212,"","","","","",""]
[213,"","","","","",""]
[214,"","","","","",""]
[215,"","","","","",""]
[216,"","","","","",""]
[217,"","","","","",""]
[218,"","","","","",""]
[219,"","","","","",""]
[220,"","","","","",""]
[221,"","","","","",""]
[222,"","","","","",""]
[223,"","","","","",""]
[224,"","","","","",""]
[225,"","","","","",""]
[226,"","","","","",""]
[227,"","","","","",""]
[228,"","","","","",""]
[229,"","","","","",""]
[230,"","","","","",""]
[231,"","","","","",""]
[232,"","","","","",""]
[233,"","","","","",""]
[234,"","","","","",""]
[235,"","","","","",""]
[236,"","","","","",""]
[237,"","","","","",""]
[238,"","","","","",""]
[239,"","","","","",""]
[240,"","","","","",""]
[241,"","","","","",""]
[242,"","","","","",""]
[243,"","","","","",""]
[244,"","","","","",""]
[245,"","","","","",""]
[246,"","","","","",""]
[247,"","","","","",""]
[248,"","","","","",""]
[249,"","","","","",""]
[250,"","","","","",""]
[251,"","","","","",""]
[252,"","","","","",""]
[253,"","","","","",""]
[254,"","","","","",""]
[255,"","","","","",""]
[256,"","","","","",""]
[257,"","","","","",""]
[258,"","","","","",""]
[259,"","","","","",""]
[260,"","","","","",""]
[261,"","","","","",""]
[262,"","","","","",""]
[263,"","","","","",""]
[264,"","","","","",""]
[265,"","","","","",""]
[266,"","","","","",""]
[267,"","","","","",""]
[268,"","","","","",""]
[269,"","","","","",""]
[270,"","","","","",""]
[271,"","","","","",""]
[272,"","","","","",""]
[273,"","","","","",""]
[274,"","","","","",""]
[275,"","","","","",""]
[276,"","","","","",""]
[277,"","","","","",""]
[278,"","","","","",""]
[279,"","","","","",""]
[280]

{"sheet":"Classt BG2","index":7,"n_rows":284,"n_cols":8,"rows_kept":284,"cut":false,"hidden":false,"merged":[[1,1,1,7]]}
[]
[null,"CROSS DU DISTRICT\nCLASSEMENT BENJAMINS 2"]
[]
[null,"PLACES","NOMS","PRENOMS","CATE","ETABLISSEMENT","VILLE","Numéro"]
[null,1,"IKUNGU BOMOLO","Imâan","BG2","DE PISAN","PERTHES",0]
[null,2,"GONTHIER","Kylian","BG2","DE PISAN","PERTHES",0]
[null,3,"AISSANI","Yanis","BG2","DOISNEAU","DAMMARIE",0]
[null,4,"CHAUSSE","Adrian","BG2","J AMYOT","MELUN",0]
[null,5,"LOPES","Yohann","BG2","BROSSOLETTE","MELUN",0]
[null,6,"BAGBEMA","Zoumana","BG2","BROSSOLETTE","MELUN",0]
[null,7,"WANSTER","alexis","BG2","J D'ARC","MELUN",0]
[null,8,"MEBTOUL","Samir","BG2","CHOPIN","MELUN",0]
[null,9,"TEKA MAYALU","Ryan","BG2","CHOPIN","MELUN",0]
[null,10,"COLONNA","Adrien Dorius","BG2","DE PISAN","PERTHES",0]
[null,11,"SYLVAIN","Julien","BG2","DE PISAN","PERTHES",0]
[null,12,"MUNTU WA MUNGU","Vimoj","BG2","CAPUCINS","MELUN",0]
[null,13,"INCANDELA","Baptiste","BG2","DE PISAN","PERTHES",0]
[null,14,"BAVOL","Joan","BG2","LA MARE AUX CHAMPS","VAUX",0]
[null,15,"KUNZALA","Benjamin","BG2","F VILLON","PONTHIERRY",0]
[null,16,"MOHAMED","Akim","BG2","BROSSOLETTE","MELUN",0]
[null,17,"SANSON","Malo","BG2","LA MARE AUX CHAMPS","VAUX",0]
[null,18,"DIPEIN","Calvin","BG2","BROSSOLETTE","MELUN",0]
[null,19,"CABEZAS EGEA","Amaury","BG2","DE PISAN","PERTHES",0]
[null,20,"OBRIOT","Enzo","BG2","CH PEGUY","VERNEUIL",0]
[null,21,"MIALET","Antoine","BG2","DE PISAN","PERTHES",0]
[null,22,"BENALI","Riad-Mohamed","BG2","CHOPIN","MELUN",0]
[null,23,"CANTAREL","Emilio","BG2","CH PEGUY","VERNEUIL",0]
[null,24,"ISMAEL","Belaid","BG2","ELSA TRIOLET","LE MEE",0]
[null,25,"HAMMANI","Ilyess","BG2","BROSSOLETTE","MELUN",0]
[null,26,"BRICOUT","Amélien","BG2","LA MARE AUX CHAMPS","VAUX",0]
[null,27,"DOS SANTOS","Raphaël","BG2","ELSA TRIOLET","LE MEE",0]
[null,28,"HANDALA","Adam","BG2","ELSA TRIOLET","LE MEE",0]
[null,29,"BRUIANT","Antonin","BG2","F VILLON","PONTHIERRY",0]
[null,30,"BOMBAY KOY","Jason","BG2","R BONHEUR","LE CHATELET",0]
[null,31,"VEILLARD","Quentin","BG2","F VILLON","PONTHIERRY",0]
[null,32,"GAULARD","Clément","BG2","CH PEGUY","VERNEUIL",0]
[null,33,"LIMA SANCAO","Schilo","BG2","CAPUCINS","MELUN",0]
[null,34,"MOHAMED","Akim","BG2","BROSSOLETTE","MELUN",0]
[null,35,"CAKAN","Adar","BG2","CHOPIN","MELUN",0]
[null,36,"SIMON","Titouan","BG2","CH PEGUY","VERNEUIL",0]
[null,37,"DUSSUEL","Bastien","BG2","CH PEGUY","VERNEUIL",0]
[null,38,"PEREGUDOV","Steven","BG2","ELSA TRIOLET","LE MEE",0]
[null,39,"REYMOND","alexandre","BG2","J D'ARC","MELUN",0]
[null,40,"CHAMDRYKOWSKA","Arthur","BG2","LA MARE AUX CHAMPS","VAUX",0]
[null,41,"DELCROIX","Enzo","BG2","LA MARE AUX CHAMPS","VAUX",0]
[null,42,"BOISARD","Nicolas","BG2","CH PEGUY","VERNEUIL",0]
[null,43,"ASCOFARE","Djibril","BG2","BROSSOLETTE","MELUN",0]
[null,44,"JOYEZ","Robin","BG2","CH PEGUY","VERNEUIL",0]
[null,45,"SIDIBE","Mamadou","BG2","BROSSOLETTE","MELUN",0]
[null,46,"SIMONOT","Yann","BG2","LA MARE AUX CHAMPS","VAUX",0]
[null,47,"AMBATE","Chris","BG2","R BONHEUR","LE CHATELET",0]
[null,48,"DUVERGT","Rémy","BG2","R BONHEUR","LE CHATELET",0]
[null,49,"MUNTU WA MUNGU","Vimoj","BG2","CAPUCINS","MELUN",0]
[null,50,"DESPREZ","Adrien","BG2","CH PEGUY","VERNEUIL",0]
[null,51,"LAUNAY","Mathéo","BG2","CH PEGUY","VERNEUIL",0]
[null,52,"BOULERY","Ethan","BG2","CAPUCINS","MELUN",0]
[null,53,"HURTEAU","MAXIME","BG2","R BONHEUR","LE CHATELET",0]
[null,54,"KHERBACHE","Bilal","BG2","CAPUCINS","MELUN",0]
[null,55,"GALOPULO","Adam","BG2","LA MARE AUX CHAMPS","VAUX",0]
[null,56,"YESILBAS ","Yousoufcan","BG2","CHOPIN","MELUN",0]
[null,57,"LUMBNSUNGU ","Eden","BG2","CHOPIN","MELUN",0]
[null,58,"VERRES ","Clément","BG2","CHOPIN","MELUN",0]
[null,59,"OUKASSOU ","Mohamed","BG2","CHOPIN","MELUN",0]
[null,60,"BENDJEBBOUR","Zakaria","BG2","CHOPIN","MELUN",0]
[null,61,"KHAPIZOV ","Djabrail","BG2","CHOPIN","MELUN",0]
[null,62,"DURRWEL ","Rudy","BG2","CHOPIN","MELUN",0]
[null,63,"LUCEA ","Menjy","BG2","CHOPIN","MELUN",0]
[null,64,"","","","","",""]
[null,65,"","","","","",""]
[null,66,"","","","","",""]
[null,67,"","","","","",""]
[null,68,"","","","","",""]
[null,69,"","","","","",""]
[null,70,"","","","","",""]
[null,71,"","","","","",""]
[null,72,"","","","","",""]
[null,73,"","","","","",""]
[null,74,"","","","","",""]
[null,75,"","","","","",""]
[null,76,"","","","","",""]
[null,77,"","","","","",""]
[null,78,"","","","","",""]
[null,79,"","","","","",""]
[null,80,"","","","","",""]
[null,81,"","","","","",""]
[null,82,"","","","","",""]
[null,83,"","","","","",""]
[null,84,"","","","","",""]
[null,85,"","","","","",""]
[null,86,"","","","","",""]
[null,87,"","","","","",""]
[null,88,"","","","","",""]
[null,89,"","","","","",""]
[null,90,"","","","","",""]
[null,91,"","","","","",""]
[null,92,"","","","","",""]
[null,93,"","","","","",""]
[null,94,"","","","","",""]
[null,95,"","","","","",""]
[null,96,"","","","","",""]
[null,97,"","","","","",""]
[null,98,"","","","","",""]
[null,99,"","","","","",""]
[null,100,"","","","","",""]
[null,101,"","","","","",""]
[null,102,"","","","","",""]
[null,103,"","","","","",""]
[null,104,"","","","","",""]
[null,105,"","","","","",""]
[null,106,"","","","","",""]
[null,107,"","","","","",""]
[null,108,"","","","","",""]
[null,109,"","","","","",""]
[null,110,"","","","","",""]
[null,111,"","","","","",""]
[null,112,"","","","","",""]
[null,113,"","","","","",""]
[null,114,"","","","","",""]
[null,115,"","","","","",""]
[null,116,"","","","","",""]
[null,117,"","","","","",""]
[null,118,"","","","","",""]
[null,119,"","","","","",""]
[null,120,"","","","","",""]
[null,121,"","","","","",""]
[null,122,"","","","","",""]
[null,123,"","","","","",""]
[null,124,"","","","","",""]
[null,125,"","","","","",""]
[null,126,"","","","","",""]
[null,127,"","","","","",""]
[null,128,"","","","","",""]
[null,129,"","","","","",""]
[null,130,"","","","","",""]
[null,null,"","","","","",""]
[null,null,"","","","","",""]
[null,null,"","","","","",""]
[null,null,"","","","","",""]
[null,null,"","","","","",""]
[null,null,"","","","","",""]
[null,null,"","","","","",""]
[null,null,"","","","","",""]
[null,null,"","","","","",""]
[null,null,"","","","","",""]
[null,null,"","","","","",""]
[null,null,"","","","","",""]
[null,null,"","","","","",""]
[null,null,"","","","","",""]
[null,null,"","","","","",""]
[null,null,"","","","","",""]
[null,null,"","","","","",""]
[null,null,"","","","","",""]
[null,null,"","","","","",""]
[null,null,"","","","","",""]
[null,null,"","","","","",""]
[null,null,"","","","","",""]
[null,null,"","","","","",""]
[null,null,"","","","","",""]
[null,null,"","","","","",""]
[null,null,"","","","","",""]
[null,null,"","","","","",""]
[null,null,"","","","","",""]
[null,null,"","","","","",""]
[null,null,"","","","","",""]
[null,null,"","","","","",""]
[null,null,"","","","","",""]
[null,null,"","","","","",""]
[null,null,"","","","","",""]
[null,null,"","","","","",""]
[null,null,"","","","","",""]
[null,null,"","","","","",""]
[null,null,"","","","","",""]
[null,null,"","","","","",""]
[null,null,"","","","","",""]
[null,null,"","","","","",""]
[null,null,"","","","","",""]
[null,null,"","","","","",""]
[null,null,"","","","","",""]
[null,null,"","","","","",""]
[null,null,"","","","","",""]
[null,null,"","","","","",""]
[null,null,"","","","","",""]
[null,null,"","","","","",""]
[null,null,"","","","","",""]
[null,null,"","","","","",""]
[null,null,"","","","","",""]
[null,null,"","","","","",""]
[null,null,"","","","","",""]
[null,null,"","","","","",""]
[null,null,"","","","","",""]
[null,null,"","","","","",""]
[null,null,"","","","","",""]
[null,null,"","","","","",""]
[null,null,"","","","","",""]
[null,null,"","","","","",""]
[null,null,"","","","","",""]
[null,null,"","","","","",""]
[null,null,"","","","","",""]
[null,null,"","","","","",""]
[null,null,"","","","","",""]
[null,null,"","","","","",""]
[null,null,"","","","","",""]
[null,null,"","","","","",""]
[null,null,"","","","","",""]
[null,null,"","","","","",""]
[null,null,"","","","","",""]
[null,null,"","","","","",""]
[null,null,"","","","","",""]
[null,null,"","","","","",""]
[null,null,"","","","","",""]
[null,null,"","","","","",""]
[null,null,"","","","","",""]
[null,null,"","","","","",""]
[null,null,"","","","","",""]
[null,null,"","","","","",""]
[null,null,"","","","","",""]
[null,null,"","","","","",""]
[null,null,"","","","","",""]
[null,null,"","","","","",""]
[null,null,"","","","","",""]
[null,null,"","","","","",""]
[null,null,"","","","","",""]
[null,null,"","","","","",""]
[null,null,"","","","","",""]
[null,null,"","","","","",""]
[null,null,"","","","","",""]
[null,null,"","","","","",""]
[null,null,"","","","","",""]
[null,null,"","","","","",""]
[null,null,"","","","","",""]
[null,null,"","","","","",""]
[null,null,"","","","","",""]
[null,null,"","","","","",""]
[null,null,"","","","","",""]
[null,null,"","","","","",""]
[null,null,"","","","","",""]
[null,null,"","","","","",""]
[null,null,"","","","","",""]
[null,null,"","","","","",""]
[null,null,"","","","","",""]
[null,null,"","","","","",""]
[null,null,"","","","","",""]
[null,null,"","","","","",""]
[null,null,"","","","","",""]
[null,null,"","","","","",""]
[null,null,"","","","","",""]
[null,null,"","","","","",""]
[null,null,"","","","","",""]
[null,null,"","","","","",""]
[null,null,"","","","","",""]
[null,null,"","","","","",""]
[null,null,"","","","","",""]
[null,null,"","","","","",""]
[null,null,"","","","","",""]
[null,null,"","","","","",""]
[null,null,"","","","","",""]
[null,null,"","","","","",""]
[null,null,"","","","","",""]
[null,null,"","","","","",""]
[null,null,"","","","","",""]
[null,null,"","","","","",""]
[null,null,"","","","","",""]
[null,null,"","","","","",""]
[null,null,"","","","","",""]
[null,null,"","","","","",""]
[null,null,"","","","","",""]
[null,null,"","","","","",""]
[null,null,"","","","","",""]
[null,null,"","","","","",""]
[null,null,"","","","","",""]
[null,null,"","","","","",""]
[null,null,"","","","","",""]
[null,null,"","","","","",""]
[null,null,"","","","","",""]
[null,null,"","","","","",""]
[null,null,"","","","","",""]
[null,null,"","","","","",""]
[null,null,"","","","","",""]
[null,null,"","","","","",""]
[null,null,"","","","","",""]
[null,null,"","","","","",""]
[null,null,"","","","","",""]
[null,null,"","","","","",""]
[null,null,"","","","","",""]

{"sheet":"Classt Scratch MinF","index":8,"n_rows":284,"n_cols":9,"rows_kept":284,"cut":false,"hidden":false,"merged":[[1,1,1,8]]}
[]
[null,"CROSS DU DISTRICT\nMINIMES CADETTES FILLES CLASSEMENT SCRATCH"]
[]
[null,"Dossard","PLACES","NOMS","PRENOMS","CATE","ETABLISSEMENT","VILLE","N°"]
[null,2408,1,{"$f":"IF($B5=\"\",\"\",LOOKUP($B5,BASE,nom))","v":"CUSSY"},{"$f":"IF($B5=\"\",\"\",LOOKUP($B5,BASE,prenom))","v":"Eva"},{"$f":"IF($B5=\"\",\"\",LOOKUP($B5,BASE,cat))","v":"MF"},{"$f":"IF($B5=\"\",\"\",LOOKUP($B5,BASE,etab))","v":"J AMYOT"},{"$f":"IF($B5=\"\",\"\",LOOKUP($B5,BASE,VILLE))","v":"MELUN"},{"$f":"IF($B5=\"\",\"\",LOOKUP($B5,BASE,Num))","v":0}]
[null,2708,2,"VIREVIALLE","justine","MF","J D'ARC","MELUN",0]
[null,2401,3,"VIGNAL","Margot","MF","J AMYOT","MELUN",0]
[null,3914,4,"MASCARIN","Olivia","MF","R BONHEUR","LE CHATELET",0]
[null,2469,5,"HOUELLE","FLORIANE","MF","J AMYOT","MELUN",0]
[null,1321,6,"RIBEREAU-GAYON","Clotilde","MF","DE PISAN","PERTHES",0]
[null,662,7,"LAIGLE","Héloïse","MF","CH PEGUY","VERNEUIL",0]
[null,621,8,"MICHAUD","Manon","MF","CH PEGUY","VERNEUIL",0]
[null,2404,9,"INSINSKI","Mathilde","MF","J AMYOT","MELUN",0]
[null,1322,10,"BOURGEOIS","Florine","MF","DE PISAN","PERTHES",0]
[null,1801,11,"FAHIM","Zinab","CF","ELSA TRIOLET","LE MEE",0]
[null,2403,12,"SAWA","Ludivine","MF","J AMYOT","MELUN",0]
[null,3306,13,"SIMONNOT","Axelle","MF","LA MARE AUX CHAMPS","VAUX",0]
[null,3619,14,"BOUEDO","Annaelle","MF","NAZARETH","VOISENON",0]
[null,663,15,"BARDOCHAN","Vanessa","MF","CH PEGUY","VERNEUIL",0]
[null,1288,16,"FICHEUX","Juliette","MF","DE PISAN","PERTHES",0]
[null,1281,17,"FLAMANT","Lisa","MF","DE PISAN","PERTHES",0]
[null,64,18,"RABHI","Abla","MF","BROSSOLETTE","MELUN",0]
[null,1323,19,"BRUNEL","Eva","MF","DE PISAN","PERTHES",0]
[null,1505,20,"HAUDRY","Juliette","MF","DOISNEAU","DAMMARIE",0]
[null,3345,21,"SOAVE","Carla","MF","LA MARE AUX CHAMPS","VAUX",0]
[null,664,22,"DESCHAMPS","Emma","MF","CH PEGUY","VERNEUIL",0]
[null,1524,23,"KHATALI","Nesrine","MF","DOISNEAU","DAMMARIE",0]
[null,3329,24,"POITTEVIN","Jeanne","MF","LA MARE AUX CHAMPS","VAUX",0]
[null,323,25,"BOULERY","Lou-Ann","MF","CAPUCINS","MELUN",0]
[null,3334,26,"AUDAT","Moira","MF","LA MARE AUX CHAMPS","VAUX",0]
[null,622,27,"CHAVES","Marie","MF","CH PEGUY","VERNEUIL",0]
[null,1282,28,"TEXIER","Athénaïs","MF","DE PISAN","PERTHES",0]
[null,1286,29,"PESTAT","Erelle","MF","DE PISAN","PERTHES",0]
[null,3920,30,"HAUSE","Solenn","MF","R BONHEUR","LE CHATELET",0]
[null,2709,31,"PALUMBO","chloé","MF","J D'ARC","MELUN",0]
[null,625,32,"JOUAULT","Victoire","MF","CH PEGUY","VERNEUIL",0]
[null,2407,33,"AGUEJGUAL","Zineb","MF","J AMYOT","MELUN",0]
[null,3917,34,"GAIGNON","Léna","MF","R BONHEUR","LE CHATELET",0]
[null,74,35,"AUGUSTO","Elanore","MF","BROSSOLETTE","MELUN",0]
[null,3330,36,"DESRUELLES","Lola","MF","LA MARE AUX CHAMPS","VAUX",0]
[null,3930,37,"COURBET","LUCIE","MF","R BONHEUR","LE CHATELET",0]
[null,671,38,"HAREL","Marie","MF","CH PEGUY","VERNEUIL",0]
[null,632,39,"MICAELI","Oceane","MF","CH PEGUY","VERNEUIL",0]
[null,2405,40,"MADIABOLA","Megane","MF","J AMYOT","MELUN",0]
[null,2409,41,"MOREIRA","Julie","MF","J AMYOT","MELUN",0]
[null,3323,42,"BERTRAND","Cassandra","MF","LA MARE AUX CHAMPS","VAUX",0]
[null,3012,43,"BENSAID","Amira","MF","LA FONTAINE","LE MEE",0]
[null,3303,44,"OUAZARI","Mina","CF","LA MARE AUX CHAMPS","VAUX",0]
[null,672,45,"CASIMIRIUS","Janna","MF","CH PEGUY","VERNEUIL",0]
[null,67,46,"CHABLIS","Merveille","MF","BROSSOLETTE","MELUN",0]
[null,1849,47,"CISSE","Salimata","MF","ELSA TRIOLET","LE MEE",0]
[null,624,48,"ROULY","Alicia","MF","CH PEGUY","VERNEUIL",0]
[null,3925,49,"CHEVILLOT ","Gwladys","MF","R BONHEUR","LE CHATELET",0]
[null,764,50,"QUEMADO","JULIE","MF","CH PEGUY","VERNEUIL",0]
[null,1807,51,"ARZUR","Alison","MF","ELSA TRIOLET","LE MEE",0]
[null,3325,52,"ARTHUS","Venus","MF","LA MARE AUX CHAMPS","VAUX",0]
[null,913,53,"DELUGE","Mélissa","MF","CHOPIN","MELUN",0]
[null,667,54,"HOURDEAU","Maëlie","MF","CH PEGUY","VERNEUIL",0]
[null,917,55,"BENZIANE","Halima","MF","CHOPIN","MELUN",0]
[null,765,56,"CLOAREC","HANNAH","MF","CH PEGUY","VERNEUIL",0]
[null,963,57,"HADBI ","Soulaf","MF","CHOPIN","MELUN",0]
[null,628,58,"CRESTO","Margot","MF","CH PEGUY","VERNEUIL",0]
[null,1830,59,"JAOUAL","Rim","MF","ELSA TRIOLET","LE MEE",0]
[null,1520,60,"YESILTAS","Derya","MF","DOISNEAU","DAMMARIE",0]
[null,676,61,"GALLEGO","Lea","MF","CH PEGUY","VERNEUIL",0]
[null,76,62,"VANG","Océane","MF","BROSSOLETTE","MELUN",0]
[null,675,63,"LOVERA","Pauline","MF","CH PEGUY","VERNEUIL",0]
[null,629,64,"POMART","Eugénie","MF","CH PEGUY","VERNEUIL",0]
[null,1889,65,{"$f":"IF($B69=\"\",\"\",LOOKUP($B69,BASE,nom))","v":"RAMDANE"},{"$f":"IF($B69=\"\",\"\",LOOKUP($B69,BASE,prenom))","v":"Malika"},{"$f":"IF($B69=\"\",\"\",LOOKUP($B69,BASE,cat))","v":"MF"},{"$f":"IF($B69=\"\",\"\",LOOKUP($B69,BASE,etab))","v":"ELSA TRIOLET"},{"$f":"IF($B69=\"\",\"\",LOOKUP($B69,BASE,VILLE))","v":"LE MEE"},{"$f":"IF($B69=\"\",\"\",LOOKUP($B69,BASE,Num))","v":0}]
[null,3923,66,"HOARAU","Maëva","MF","R BONHEUR","LE CHATELET",0]
[null,3328,67,"ANDRIEU","Sidonie","MF","LA MARE AUX CHAMPS","VAUX",0]
[null,3924,68,"PRAVET","Lilou","MF","R BONHEUR","LE CHATELET",0]
[null,3916,69,"LE SAUX","Mathilde","MF","R BONHEUR","LE CHATELET",0]
[null,3618,70,"DE ARAUJO","Maëlys","MF","NAZARETH","VOISENON",0]
[null,3307,71,"GORGE BERNAT","Clara","MF","LA MARE AUX CHAMPS","VAUX",0]
[null,634,72,"DELCAME","Lunna","MF","CH PEGUY","VERNEUIL",0]
[null,640,73,"LE PRAEL","Léa","MF","CH PEGUY","VERNEUIL",0]
[null,3007,74,"ROGIER","Manuella","MF","LA FONTAINE","LE MEE",0]
[null,637,75,"JOYEZ","Ambre","MF","CH PEGUY","VERNEUIL",0]
[null,1827,76,"LABBEZ","Thiphaine","MF","ELSA TRIOLET","LE MEE",0]
[null,636,77,"FONSECA","Morine","MF","CH PEGUY","VERNEUIL",0]
[null,696,78,"JACQUEMIN","Auriane","MF","CH PEGUY","VERNEUIL",0]
[null,3318,79,"GOMEZ CALLO","Gwendoline","MF","LA MARE AUX CHAMPS","VAUX",0]
[null,3320,80,"BADER","Helene","MF","LA MARE AUX CHAMPS","VAUX",0]
[null,3324,81,"FERNANDEZ","Elsa","MF","LA MARE AUX CHAMPS","VAUX",0]
[null,3322,82,"PAISLEY","Laure","MF","LA MARE AUX CHAMPS","VAUX",0]
[null,638,83,"KUHN","Justine","MF","CH PEGUY","VERNEUIL",0]
[null,311,84,"ZEGHOUDI","Noria","MF","CAPUCINS","MELUN",0]
[null,3011,85,"ABDEL WEDOUD","Zeinabou","MF","LA FONTAINE","LE MEE",0]
[null,2468,86,"ZEKER","EZGI","MF","J AMYOT","MELUN",0]
[null,3006,87,"RHENZOUR","Soumaya","MF","LA FONTAINE","LE MEE",0]
[null,null,88,"","","","","",""]
[null,null,89,"","","","","",""]
[null,null,90,"","","","","",""]
[null,null,91,"","","","","",""]
[null,null,92,"","","","","",""]
[null,null,93,"","","","","",""]
[null,null,94,"","","","","",""]
[null,null,95,"","","","","",""]
[null,null,96,"","","","","",""]
[null,null,97,"","","","","",""]
[null,null,98,"","","","","",""]
[null,null,99,"","","","","",""]
[null,null,100,"","","","","",""]
[null,null,101,"","","","","",""]
[null,null,102,"","","","","",""]
[null,null,103,"","","","","",""]
[null,null,104,"","","","","",""]
[null,null,105,"","","","","",""]
[null,null,106,"","","","","",""]
[null,null,107,"","","","","",""]
[null,null,108,"","","","","",""]
[null,null,109,"","","","","",""]
[null,null,110,"","","","","",""]
[null,null,111,"","","","","",""]
[null,null,112,"","","","","",""]
[null,null,113,"","","","","",""]
[null,null,114,"","","","","",""]
[null,null,115,"","","","","",""]
[null,null,116,"","","","","",""]
[null,null,117,"","","","","",""]
[null,null,118,"","","","","",""]
[null,null,119,"","","","","",""]
[null,null,120,"","","","","",""]
[null,null,121,"","","","","",""]
[null,null,122,"","","","","",""]
[null,null,123,"","","","","",""]
[null,null,124,"","","","","",""]
[null,null,125,"","","","","",""]
[null,null,126,"","","","","",""]
[null,null,127,"","","","","",""]
[null,null,128,"","","","","",""]
[null,null,129,{"$f":"IF($B133=\"\",\"\",LOOKUP($B133,BASE,nom))","v":""},{"$f":"IF($B133=\"\",\"\",LOOKUP($B133,BASE,prenom))","v":""},{"$f":"IF($B133=\"\",\"\",LOOKUP($B133,BASE,cat))","v":""},{"$f":"IF($B133=\"\",\"\",LOOKUP($B133,BASE,etab))","v":""},{"$f":"IF($B133=\"\",\"\",LOOKUP($B133,BASE,VILLE))","v":""},{"$f":"IF($B133=\"\",\"\",LOOKUP($B133,BASE,Num))","v":""}]
[null,null,130,"","","","","",""]
[null,null,131,"","","","","",""]
[null,null,132,"","","","","",""]
[null,null,133,"","","","","",""]
[null,null,134,"","","","","",""]
[null,null,135,"","","","","",""]
[null,null,136,"","","","","",""]
[null,null,137,"","","","","",""]
[null,null,138,"","","","","",""]
[null,null,139,"","","","","",""]
[null,null,140,"","","","","",""]
[null,null,141,"","","","","",""]
[null,null,142,"","","","","",""]
[null,null,143,"","","","","",""]
[null,null,144,"","","","","",""]
[null,null,145,"","","","","",""]
[null,null,146,"","","","","",""]
[null,null,147,"","","","","",""]
[null,null,148,"","","","","",""]
[null,null,149,"","","","","",""]
[null,null,150,"","","","","",""]
[null,null,151,"","","","","",""]
[null,null,152,"","","","","",""]
[null,null,153,"","","","","",""]
[null,null,154,"","","","","",""]
[null,null,155,"","","","","",""]
[null,null,156,"","","","","",""]
[null,null,157,"","","","","",""]
[null,null,158,"","","","","",""]
[null,null,159,"","","","","",""]
[null,null,160,"","","","","",""]
[null,null,161,"","","","","",""]
[null,null,162,"","","","","",""]
[null,null,163,"","","","","",""]
[null,null,164,"","","","","",""]
[null,null,165,"","","","","",""]
[null,null,166,"","","","","",""]
[null,null,167,"","","","","",""]
[null,null,168,"","","","","",""]
[null,null,169,"","","","","",""]
[null,null,170,"","","","","",""]
[null,null,171,"","","","","",""]
[null,null,172,"","","","","",""]
[null,null,173,"","","","","",""]
[null,null,174,"","","","","",""]
[null,null,175,"","","","","",""]
[null,null,176,"","","","","",""]
[null,null,177,"","","","","",""]
[null,null,178,"","","","","",""]
[null,null,179,"","","","","",""]
[null,null,180,"","","","","",""]
[null,null,181,"","","","","",""]
[null,null,182,"","","","","",""]
[null,null,183,"","","","","",""]
[null,null,184,"","","","","",""]
[null,null,185,"","","","","",""]
[null,null,186,"","","","","",""]
[null,null,187,"","","","","",""]
[null,null,188,"","","","","",""]
[null,null,189,"","","","","",""]
[null,null,190,"","","","","",""]
[null,null,191,"","","","","",""]
[null,null,192,"","","","","",""]
[null,null,193,{"$f":"IF($B197=\"\",\"\",LOOKUP($B197,BASE,nom))","v":""},{"$f":"IF($B197=\"\",\"\",LOOKUP($B197,BASE,prenom))","v":""},{"$f":"IF($B197=\"\",\"\",LOOKUP($B197,BASE,cat))","v":""},{"$f":"IF($B197=\"\",\"\",LOOKUP($B197,BASE,etab))","v":""},{"$f":"IF($B197=\"\",\"\",LOOKUP($B197,BASE,VILLE))","v":""},{"$f":"IF($B197=\"\",\"\",LOOKUP($B197,BASE,Num))","v":""}]
[null,null,194,"","","","","",""]
[null,null,195,"","","","","",""]
[null,null,196,"","","","","",""]
[null,null,197,"","","","","",""]
[null,null,198,"","","","","",""]
[null,null,199,"","","","","",""]
[null,null,200,"","","","","",""]
[null,null,201,"","","","","",""]
[null,null,202,"","","","","",""]
[null,null,203,"","","","","",""]
[null,null,204,"","","","","",""]
[null,null,205,"","","","","",""]
[null,null,206,"","","","","",""]
[null,null,207,"","","","","",""]
[null,null,208,"","","","","",""]
[null,null,209,"","","","","",""]
[null,null,210,"","","","","",""]
[null,null,211,"","","","","",""]
[null,null,212,"","","","","",""]
[null,null,213,"","","","","",""]
[null,null,214,"","","","","",""]
[null,null,215,"","","","","",""]
[null,null,216,"","","","","",""]
[null,null,217,"","","","","",""]
[null,null,218,"","","","","",""]
[null,null,219,"","","","","",""]
[null,null,220,"","","","","",""]
[null,null,221,"","","","","",""]
[null,null,222,"","","","","",""]
[null,null,223,"","","","","",""]
[null,null,224,"","","","","",""]
[null,null,225,"","","","","",""]
[null,null,226,"","","","","",""]
[null,null,227,"","","","","",""]
[null,null,228,"","","","","",""]
[null,null,229,"","","","","",""]
[null,null,230,"","","","","",""]
[null,null,231,"","","","","",""]
[null,null,232,"","","","","",""]
[null,null,233,"","","","","",""]
[null,null,234,"","","","","",""]
[null,null,235,"","","","","",""]
[null,null,236,"","","","","",""]
[null,null,237,"","","","","",""]
[null,null,238,"","","","","",""]
[null,null,239,"","","","","",""]
[null,null,240,"","","","","",""]
[null,null,241,"","","","","",""]
[null,null,242,"","","","","",""]
[null,null,243,"","","","","",""]
[null,null,244,"","","","","",""]
[null,null,245,"","","","","",""]
[null,null,246,"","","","","",""]
[null,null,247,"","","","","",""]
[null,null,248,"","","","","",""]
[null,null,249,"","","","","",""]
[null,null,250,"","","","","",""]
[null,null,251,"","","","","",""]
[null,null,252,"","","","","",""]
[null,null,253,"","","","","",""]
[null,null,254,"","","","","",""]
[null,null,255,"","","","","",""]
[null,null,256,"","","","","",""]
[null,null,257,{"$f":"IF($B261=\"\",\"\",LOOKUP($B261,BASE,nom))","v":""},{"$f":"IF($B261=\"\",\"\",LOOKUP($B261,BASE,prenom))","v":""},{"$f":"IF($B261=\"\",\"\",LOOKUP($B261,BASE,cat))","v":""},{"$f":"IF($B261=\"\",\"\",LOOKUP($B261,BASE,etab))","v":""},{"$f":"IF($B261=\"\",\"\",LOOKUP($B261,BASE,VILLE))","v":""},{"$f":"IF($B261=\"\",\"\",LOOKUP($B261,BASE,Num))","v":""}]
[null,null,258,"","","","","",""]
[null,null,259,"","","","","",""]
[null,null,260,"","","","","",""]
[null,null,261,"","","","","",""]
[null,null,262,"","","","","",""]
[null,null,263,"","","","","",""]
[null,null,264,"","","","","",""]
[null,null,265,"","","","","",""]
[null,null,266,"","","","","",""]
[null,null,267,"","","","","",""]
[null,null,268,"","","","","",""]
[null,null,269,"","","","","",""]
[null,null,270,"","","","","",""]
[null,null,271,"","","","","",""]
[null,null,272,"","","","","",""]
[null,null,273,"","","","","",""]
[null,null,274,"","","","","",""]
[null,null,275,"","","","","",""]
[null,null,276,"","","","","",""]
[null,null,277,"","","","","",""]
[null,null,278,"","","","","",""]
[null,null,279,"","","","","",""]
[null,null,280,{"$f":"IF($B284=\"\",\"\",LOOKUP($B284,BASE,nom))","v":""},{"$f":"IF($B284=\"\",\"\",LOOKUP($B284,BASE,prenom))","v":""},{"$f":"IF($B284=\"\",\"\",LOOKUP($B284,BASE,cat))","v":""},"",{"$f":"IF($B284=\"\",\"\",LOOKUP($B284,BASE,VILLE))","v":""},{"$f":"IF($B284=\"\",\"\",LOOKUP($B284,BASE,Num))","v":""}]

{"sheet":"Classt Min F","index":9,"n_rows":284,"n_cols":8,"rows_kept":284,"cut":false,"hidden":false,"merged":[[1,0,1,6]]}
[]
["CROSS DU DISTRICT\nCLASSEMENT MINIMES FILLES "]
[]
["PLACE","NOMS","PRENOMS","CATE","ETABLISSEMENT","VILLE","Num"]
[1,"CUSSY","Eva","MF","J AMYOT","MELUN",0,""]
[2,"VIREVIALLE","justine","MF","J D'ARC","MELUN",0]
[3,"VIGNAL","Margot","MF","J AMYOT","MELUN",0]
[4,"MASCARIN","Olivia","MF","R BONHEUR","LE CHATELET",0]
[5,"HOUELLE","FLORIANE","MF","J AMYOT","MELUN",0]
[6,"RIBEREAU-GAYON","Clotilde","MF","DE PISAN","PERTHES",0]
[7,"LAIGLE","Héloïse","MF","CH PEGUY","VERNEUIL",0]
[8,"MICHAUD","Manon","MF","CH PEGUY","VERNEUIL",0]
[9,"INSINSKI","Mathilde","MF","J AMYOT","MELUN",0]
[10,"BOURGEOIS","Florine","MF","DE PISAN","PERTHES",0]
[11,"SAWA","Ludivine","MF","J AMYOT","MELUN",0]
[12,"SIMONNOT","Axelle","MF","LA MARE AUX CHAMPS","VAUX",0]
[13,"BOUEDO","Annaelle","MF","NAZARETH","VOISENON",0]
[14,"BARDOCHAN","Vanessa","MF","CH PEGUY","VERNEUIL",0]
[15,"FICHEUX","Juliette","MF","DE PISAN","PERTHES",0]
[16,"FLAMANT","Lisa","MF","DE PISAN","PERTHES",0]
[17,"RABHI","Abla","MF","BROSSOLETTE","MELUN",0]
[18,"BRUNEL","Eva","MF","DE PISAN","PERTHES",0]
[19,"HAUDRY","Juliette","MF","DOISNEAU","DAMMARIE",0]
[20,"SOAVE","Carla","MF","LA MARE AUX CHAMPS","VAUX",0]
[21,"DESCHAMPS","Emma","MF","CH PEGUY","VERNEUIL",0]
[22,"KHATALI","Nesrine","MF","DOISNEAU","DAMMARIE",0]
[23,"POITTEVIN","Jeanne","MF","LA MARE AUX CHAMPS","VAUX",0]
[24,"BOULERY","Lou-Ann","MF","CAPUCINS","MELUN",0]
[25,"AUDAT","Moira","MF","LA MARE AUX CHAMPS","VAUX",0]
[26,"CHAVES","Marie","MF","CH PEGUY","VERNEUIL",0]
[27,"TEXIER","Athénaïs","MF","DE PISAN","PERTHES",0]
[28,"PESTAT","Erelle","MF","DE PISAN","PERTHES",0]
[29,"HAUSE","Solenn","MF","R BONHEUR","LE CHATELET",0]
[30,"PALUMBO","chloé","MF","J D'ARC","MELUN",0]
[31,"JOUAULT","Victoire","MF","CH PEGUY","VERNEUIL",0]
[32,"AGUEJGUAL","Zineb","MF","J AMYOT","MELUN",0]
[33,"GAIGNON","Léna","MF","R BONHEUR","LE CHATELET",0]
[34,"AUGUSTO","Elanore","MF","BROSSOLETTE","MELUN",0]
[35,"DESRUELLES","Lola","MF","LA MARE AUX CHAMPS","VAUX",0]
[36,"COURBET","LUCIE","MF","R BONHEUR","LE CHATELET",0]
[37,"HAREL","Marie","MF","CH PEGUY","VERNEUIL",0]
[38,"MICAELI","Oceane","MF","CH PEGUY","VERNEUIL",0]
[39,"MADIABOLA","Megane","MF","J AMYOT","MELUN",0]
[40,"MOREIRA","Julie","MF","J AMYOT","MELUN",0]
[41,"BERTRAND","Cassandra","MF","LA MARE AUX CHAMPS","VAUX",0]
[42,"BENSAID","Amira","MF","LA FONTAINE","LE MEE",0]
[43,"CASIMIRIUS","Janna","MF","CH PEGUY","VERNEUIL",0]
[44,"CHABLIS","Merveille","MF","BROSSOLETTE","MELUN",0]
[45,"CISSE","Salimata","MF","ELSA TRIOLET","LE MEE",0]
[46,"ROULY","Alicia","MF","CH PEGUY","VERNEUIL",0]
[47,"CHEVILLOT ","Gwladys","MF","R BONHEUR","LE CHATELET",0]
[48,"QUEMADO","JULIE","MF","CH PEGUY","VERNEUIL",0]
[49,"ARZUR","Alison","MF","ELSA TRIOLET","LE MEE",0]
[50,"ARTHUS","Venus","MF","LA MARE AUX CHAMPS","VAUX",0]
[51,"DELUGE","Mélissa","MF","CHOPIN","MELUN",0]
[52,"HOURDEAU","Maëlie","MF","CH PEGUY","VERNEUIL",0]
[53,"BENZIANE","Halima","MF","CHOPIN","MELUN",0]
[54,"CLOAREC","HANNAH","MF","CH PEGUY","VERNEUIL",0]
[55,"HADBI ","Soulaf","MF","CHOPIN","MELUN",0]
[56,"CRESTO","Margot","MF","CH PEGUY","VERNEUIL",0]
[57,"JAOUAL","Rim","MF","ELSA TRIOLET","LE MEE",0]
[58,"YESILTAS","Derya","MF","DOISNEAU","DAMMARIE",0]
[59,"GALLEGO","Lea","MF","CH PEGUY","VERNEUIL",0]
[60,"VANG","Océane","MF","BROSSOLETTE","MELUN",0]
[61,"LOVERA","Pauline","MF","CH PEGUY","VERNEUIL",0]
[62,"POMART","Eugénie","MF","CH PEGUY","VERNEUIL",0]
[63,"RAMDANE","Malika","MF","ELSA TRIOLET","LE MEE",0]
[64,"HOARAU","Maëva","MF","R BONHEUR","LE CHATELET",0]
[65,"ANDRIEU","Sidonie","MF","LA MARE AUX CHAMPS","VAUX",0]
[66,"PRAVET","Lilou","MF","R BONHEUR","LE CHATELET",0]
[67,"LE SAUX","Mathilde","MF","R BONHEUR","LE CHATELET",0]
[68,"DE ARAUJO","Maëlys","MF","NAZARETH","VOISENON",0]
[69,"GORGE BERNAT","Clara","MF","LA MARE AUX CHAMPS","VAUX",0]
[70,"DELCAME","Lunna","MF","CH PEGUY","VERNEUIL",0]
[71,"LE PRAEL","Léa","MF","CH PEGUY","VERNEUIL",0]
[72,"ROGIER","Manuella","MF","LA FONTAINE","LE MEE",0]
[73,"JOYEZ","Ambre","MF","CH PEGUY","VERNEUIL",0]
[74,"LABBEZ","Thiphaine","MF","ELSA TRIOLET","LE MEE",0]
[75,"FONSECA","Morine","MF","CH PEGUY","VERNEUIL",0]
[76,"JACQUEMIN","Auriane","MF","CH PEGUY","VERNEUIL",0]
[77,"GOMEZ CALLO","Gwendoline","MF","LA MARE AUX CHAMPS","VAUX",0]
[78,"BADER","Helene","MF","LA MARE AUX CHAMPS","VAUX",0]
[79,"FERNANDEZ","Elsa","MF","LA MARE AUX CHAMPS","VAUX",0,""]
[80,"PAISLEY","Laure","MF","LA MARE AUX CHAMPS","VAUX",0,""]
[81,"KUHN","Justine","MF","CH PEGUY","VERNEUIL",0,""]
[82,"ZEGHOUDI","Noria","MF","CAPUCINS","MELUN",0,""]
[83,"ABDEL WEDOUD","Zeinabou","MF","LA FONTAINE","LE MEE",0,""]
[84,"ZEKER","EZGI","MF","J AMYOT","MELUN",0,""]
[85,"RHENZOUR","Soumaya","MF","LA FONTAINE","LE MEE",0,""]
[86,"","","","","","",""]
[87,"","","","","","",""]
[88,"","","","","","",""]
[89,"","","","","","",""]
[90,"","","","","","",""]
[91,"","","","","","",""]
[92,"","","","","","",""]
[93,"","","","","","",""]
[94,"","","","","","",""]
[95,"","","","","","",""]
[96,"","","","","","",""]
[97,"","","","","","",""]
[98,"","","","","","",""]
[99,"","","","","","",""]
[100,"","","","","","",""]
[101,"","","","","","",""]
[102,"","","","","","",""]
[103,"","","","","","",""]
[104,"","","","","","",""]
[105,"","","","","","",""]
[106,"","","","","","",""]
[107,"","","","","","",""]
[108,"","","","","","",""]
[109,"","","","","","",""]
[110,"","","","","","",""]
[111,"","","","","","",""]
[112,"","","","","","",""]
[113,"","","","","","",""]
[114,"","","","","","",""]
[115,"","","","","","",""]
[116,"","","","","","",""]
[117,"","","","","","",""]
[118,"","","","","","",""]
[119,"","","","","","",""]
[120,"","","","","","",""]
[121,"","","","","","",""]
[122,"","","","","","",""]
[123,"","","","","","",""]
[124,"","","","","","",""]
[125,"","","","","","",""]
[126,"","","","","","",""]
[127,"","","","","","",""]
[128,"","","","","","",""]
[129,"","","","","","",""]
[130,"","","","","","",""]
[null,"","","","","",""]
[null,"","","","","",""]
[null,"","","","","",""]
[null,"","","","","",""]
[null,"","","","","",""]
[null,"","","","","",""]
[null,"","","","","",""]
[null,"","","","","",""]
[null,"","","","","",""]
[null,"","","","","",""]
[null,"","","","","",""]
[null,"","","","","",""]
[null,"","","","","",""]
[null,"","","","","",""]
[null,"","","","","",""]
[null,"","","","","",""]
[null,"","","","","",""]
[null,"","","","","",""]
[null,"","","","","",""]
[null,"","","","","",""]
[null,"","","","","",""]
[null,"","","","","",""]
[null,"","","","","",""]
[null,"","","","","",""]
[null,"","","","","",""]
[null,"","","","","",""]
[null,"","","","","",""]
[null,"","","","","",""]
[null,"","","","","",""]
[null,"","","","","",""]
[null,"","","","","",""]
[null,"","","","","",""]
[null,"","","","","",""]
[null,"","","","","",""]
[null,"","","","","",""]
[null,"","","","","",""]
[null,"","","","","",""]
[null,"","","","","",""]
[null,"","","","","",""]
[null,"","","","","",""]
[null,"","","","","",""]
[null,"","","","","",""]
[null,"","","","","",""]
[null,"","","","","",""]
[null,"","","","","",""]
[null,"","","","","",""]
[null,"","","","","",""]
[null,"","","","","",""]
[null,"","","","","",""]
[null,"","","","","",""]
[null,"","","","","",""]
[null,"","","","","",""]
[null,"","","","","",""]
[null,"","","","","",""]
[null,"","","","","",""]
[null,"","","","","",""]
[null,"","","","","",""]
[null,"","","","","",""]
[null,"","","","","",""]
[null,"","","","","",""]
[null,"","","","","",""]
[null,"","","","","",""]
[null,"","","","","",""]
[null,"","","","","",""]
[null,"","","","","",""]
[null,"","","","","",""]
[null,"","","","","",""]
[null,"","","","","",""]
[null,"","","","","",""]
[null,"","","","","",""]
[null,"","","","","",""]
[null,"","","","","",""]
[null,"","","","","",""]
[null,"","","","","",""]
[null,"","","","","",""]
[null,"","","","","",""]
[null,"","","","","",""]
[null,"","","","","",""]
[null,"","","","","",""]
[null,"","","","","",""]
[null,"","","","","",""]
[null,"","","","","",""]
[null,"","","","","",""]
[null,"","","","","",""]
[null,"","","","","",""]
[null,"","","","","",""]
[null,"","","","","",""]
[null,"","","","","",""]
[null,"","","","","",""]
[null,"","","","","",""]
[null,"","","","","",""]
[null,"","","","","",""]
[null,"","","","","",""]
[null,"","","","","",""]
[null,"","","","","",""]
[null,"","","","","",""]
[null,"","","","","",""]
[null,"","","","","",""]
[null,"","","","","",""]
[null,"","","","","",""]
[null,"","","","","",""]
[null,"","","","","",""]
[null,"","","","","",""]
[null,"","","","","",""]
[null,"","","","","",""]
[null,"","","","","",""]
[null,"","","","","",""]
[null,"","","","","",""]
[null,"","","","","",""]
[null,"","","","","",""]
[null,"","","","","",""]
[null,"","","","","",""]
[null,"","","","","",""]
[null,"","","","","",""]
[null,"","","","","",""]
[null,"","","","","",""]
[null,"","","","","",""]
[null,"","","","","",""]
[null,"","","","","",""]
[null,"","","","","",""]
[null,"","","","","",""]
[null,"","","","","",""]
[null,"","","","","",""]
[null,"","","","","",""]
[null,"","","","","",""]
[null,"","","","","",""]
[null,"","","","","",""]
[null,"","","","","",""]
[null,"","","","","",""]
[null,"","","","","",""]
[null,"","","","","",""]
[null,"","","","","",""]
[null,"","","","","",""]
[null,"","","","","",""]
[null,"","","","","",""]
[null,"","","","","",""]
[null,"","","","","",""]
[null,"","","","","",""]
[null,"","","","","",""]
[null,"","","","","",""]
[null,"","","","","",""]
[null,"","","","","",""]
[null,"","","","","",""]
[null,"","","","","",""]
[null,"","","","","",""]
[null,"","","","","",""]
[null,"","","","","",""]
[null,"","","","","",""]
[null,"","","","","",""]
[null,"","","","","",""]

{"sheet":"Classt Cadettes","index":10,"n_rows":284,"n_cols":8,"rows_kept":284,"cut":false,"hidden":false,"merged":[[1,0,1,6]]}
[]
["CROSS DU DISTRICT\nCLASSEMENT CADETTES FILLES "]
[]
["PLACE","NOMS","PRENOMS","CATE","ETABLISSEMENT","VILLE","Num"]
[1,"FAHIM","Zinab","CF","ELSA TRIOLET","LE MEE",0,""]
[2,"OUAZARI","Mina","CF","LA MARE AUX CHAMPS","VAUX",0]
[3,"","","","","",""]
[4,"","","","","",""]
[5,"","","","","",""]
[6,"","","","","",""]
[7,"","","","","",""]
[8,"","","","","",""]
[9,"","","","","",""]
[10,"","","","","",""]
[11,"","","","","",""]
[12,"","","","","",""]
[13,"","","","","",""]
[14,"","","","","",""]
[15,"","","","","",""]
[16,"","","","","",""]
[17,"","","","","",""]
[18,"","","","","",""]
[19,"","","","","",""]
[20,"","","","","",""]
[21,"","","","","",""]
[22,"","","","","",""]
[23,"","","","","",""]
[24,"","","","","",""]
[25,"","","","","",""]
[26,"","","","","",""]
[27,"","","","","",""]
[28,"","","","","",""]
[29,"","","","","",""]
[30,"","","","","",""]
[31,"","","","","",""]
[32,"","","","","",""]
[33,"","","","","",""]
[34,"","","","","",""]
[35,"","","","","",""]
[36,"","","","","",""]
[37,"","","","","",""]
[38,"","","","","",""]
[39,"","","","","",""]
[40,"","","","","",""]
[41,"","","","","",""]
[42,"","","","","",""]
[43,"","","","","",""]
[44,"","","","","",""]
[45,"","","","","",""]
[46,"","","","","",""]
[47,"","","","","",""]
[48,"","","","","",""]
[49,"","","","","",""]
[50,"","","","","",""]
[51,"","","","","",""]
[52,"","","","","",""]
[53,"","","","","",""]
[54,"","","","","",""]
[55,"","","","","",""]
[56,"","","","","",""]
[57,"","","","","",""]
[58,"","","","","",""]
[59,"","","","","",""]
[60,"","","","","",""]
[61,"","","","","",""]
[62,"","","","","",""]
[63,"","","","","",""]
[64,"","","","","",""]
[65,"","","","","",""]
[66,"","","","","",""]
[67,"","","","","",""]
[68,"","","","","",""]
[69,"","","","","",""]
[70,"","","","","",""]
[71,"","","","","",""]
[72,"","","","","",""]
[73,"","","","","",""]
[74,"","","","","",""]
[75,"","","","","",""]
[76,"","","","","",""]
[77,"","","","","",""]
[78,"","","","","",""]
[79,"","","","","","",""]
[80,"","","","","","",""]
[81,"","","","","","",""]
[82,"","","","","","",""]
[83,"","","","","","",""]
[84,"","","","","","",""]
[85,"","","","","","",""]
[86,"","","","","","",""]
[87,"","","","","","",""]
[88,"","","","","","",""]
[89,"","","","","","",""]
[90,"","","","","","",""]
[91,"","","","","","",""]
[92,"","","","","","",""]
[93,"","","","","","",""]
[94,"","","","","","",""]
[95,"","","","","","",""]
[96,"","","","","","",""]
[97,"","","","","","",""]
[98,"","","","","","",""]
[99,"","","","","","",""]
[100,"","","","","","",""]
[101,"","","","","","",""]
[102,"","","","","","",""]
[103,"","","","","","",""]
[104,"","","","","","",""]
[105,"","","","","","",""]
[106,"","","","","","",""]
[107,"","","","","","",""]
[108,"","","","","","",""]
[109,"","","","","","",""]
[110,"","","","","","",""]
[111,"","","","","","",""]
[112,"","","","","","",""]
[113,"","","","","","",""]
[114,"","","","","","",""]
[115,"","","","","","",""]
[116,"","","","","","",""]
[117,"","","","","","",""]
[118,"","","","","","",""]
[119,"","","","","","",""]
[120,"","","","","","",""]
[121,"","","","","","",""]
[122,"","","","","","",""]
[123,"","","","","","",""]
[124,"","","","","","",""]
[125,"","","","","","",""]
[126,"","","","","","",""]
[127,"","","","","","",""]
[128,"","","","","","",""]
[129,"","","","","","",""]
[130,"","","","","","",""]
[null,"","","","","",""]
[null,"","","","","",""]
[null,"","","","","",""]
[null,"","","","","",""]
[null,"","","","","",""]
[null,"","","","","",""]
[null,"","","","","",""]
[null,"","","","","",""]
[null,"","","","","",""]
[null,"","","","","",""]
[null,"","","","","",""]
[null,"","","","","",""]
[null,"","","","","",""]
[null,"","","","","",""]
[null,"","","","","",""]
[null,"","","","","",""]
[null,"","","","","",""]
[null,"","","","","",""]
[null,"","","","","",""]
[null,"","","","","",""]
[null,"","","","","",""]
[null,"","","","","",""]
[null,"","","","","",""]
[null,"","","","","",""]
[null,"","","","","",""]
[null,"","","","","",""]
[null,"","","","","",""]
[null,"","","","","",""]
[null,"","","","","",""]
[null,"","","","","",""]
[null,"","","","","",""]
[null,"","","","","",""]
[null,"","","","","",""]
[null,"","","","","",""]
[null,"","","","","",""]
[null,"","","","","",""]
[null,"","","","","",""]
[null,"","","","","",""]
[null,"","","","","",""]
[null,"","","","","",""]
[null,"","","","","",""]
[null,"","","","","",""]
[null,"","","","","",""]
[null,"","","","","",""]
[null,"","","","","",""]
[null,"","","","","",""]
[null,"","","","","",""]
[null,"","","","","",""]
[null,"","","","","",""]
[null,"","","","","",""]
[null,"","","","","",""]
[null,"","","","","",""]
[null,"","","","","",""]
[null,"","","","","",""]
[null,"","","","","",""]
[null,"","","","","",""]
[null,"","","","","",""]
[null,"","","","","",""]
[null,"","","","","",""]
[null,"","","","","",""]
[null,"","","","","",""]
[null,"","","","","",""]
[null,"","","","","",""]
[null,"","","","","",""]
[null,"","","","","",""]
[null,"","","","","",""]
[null,"","","","","",""]
[null,"","","","","",""]
[null,"","","","","",""]
[null,"","","","","",""]
[null,"","","","","",""]
[null,"","","","","",""]
[null,"","","","","",""]
[null,"","","","","",""]
[null,"","","","","",""]
[null,"","","","","",""]
[null,"","","","","",""]
[null,"","","","","",""]
[null,"","","","","",""]
[null,"","","","","",""]
[null,"","","","","",""]
[null,"","","","","",""]
[null,"","","","","",""]
[null,"","","","","",""]
[null,"","","","","",""]
[null,"","","","","",""]
[null,"","","","","",""]
[null,"","","","","",""]
[null,"","","","","",""]
[null,"","","","","",""]
[null,"","","","","",""]
[null,"","","","","",""]
[null,"","","","","",""]
[null,"","","","","",""]
[null,"","","","","",""]
[null,"","","","","",""]
[null,"","","","","",""]
[null,"","","","","",""]
[null,"","","","","",""]
[null,"","","","","",""]
[null,"","","","","",""]
[null,"","","","","",""]
[null,"","","","","",""]
[null,"","","","","",""]
[null,"","","","","",""]
[null,"","","","","",""]
[null,"","","","","",""]
[null,"","","","","",""]
[null,"","","","","",""]
[null,"","","","","",""]
[null,"","","","","",""]
[null,"","","","","",""]
[null,"","","","","",""]
[null,"","","","","",""]
[null,"","","","","",""]
[null,"","","","","",""]
[null,"","","","","",""]
[null,"","","","","",""]
[null,"","","","","",""]
[null,"","","","","",""]
[null,"","","","","",""]
[null,"","","","","",""]
[null,"","","","","",""]
[null,"","","","","",""]
[null,"","","","","",""]
[null,"","","","","",""]
[null,"","","","","",""]
[null,"","","","","",""]
[null,"","","","","",""]
[null,"","","","","",""]
[null,"","","","","",""]
[null,"","","","","",""]
[null,"","","","","",""]
[null,"","","","","",""]
[null,"","","","","",""]
[null,"","","","","",""]
[null,"","","","","",""]
[null,"","","","","",""]
[null,"","","","","",""]
[null,"","","","","",""]
[null,"","","","","",""]
[null,"","","","","",""]
[null,"","","","","",""]
[null,"","","","","",""]
[null,"","","","","",""]
[null,"","","","","",""]
[null,"","","","","",""]
[null,"","","","","",""]
[null,"","","","","",""]
[null,"","","","","",""]

{"sheet":"Classt Scratch MinG","index":11,"n_rows":284,"n_cols":9,"rows_kept":284,"cut":false,"hidden":false,"merged":[[1,1,1,8]]}
[]
[null,"CROSS DU DISTRICT\nMINIMES et CADETS GARCONS CLASSEMENT SCRATCH"]
[]
[null,"Dossard","PLACES","NOMS","PRENOMS","CATE","ETABLISSEMENT","VILLE","N°"]
[null,1341,1,{"$f":"IF($B5=\"\",\"\",LOOKUP($B5,BASE,nom))","v":"GAUBERVILLE"},{"$f":"IF($B5=\"\",\"\",LOOKUP($B5,BASE,prenom))","v":"Arnaud"},{"$f":"IF($B5=\"\",\"\",LOOKUP($B5,BASE,cat))","v":"MG"},{"$f":"IF($B5=\"\",\"\",LOOKUP($B5,BASE,etab))","v":"DE PISAN"},{"$f":"IF($B5=\"\",\"\",LOOKUP($B5,BASE,VILLE))","v":"PERTHES"},{"$f":"IF($B5=\"\",\"\",LOOKUP($B5,BASE,Num))","v":0}]
[null,3336,2,"NOVIER","Nathan","MG","LA MARE AUX CHAMPS","VAUX",0]
[null,1342,3,"MINNITI ANDREI","Pierre","MG","DE PISAN","PERTHES",0]
[null,2721,4,"WANSTER","willy","MG","J D'ARC","MELUN",0]
[null,1522,5,"HORTAS","Mylan","MG","DOISNEAU","DAMMARIE",0]
[null,2414,6,"LANDEL","Arthur","CG","J AMYOT","MELUN",0]
[null,1528,7,"GOUGET","Esteban","MG","DOISNEAU","DAMMARIE",0]
[null,641,8,"MIGNOT","Clément","MG","CH PEGUY","VERNEUIL",0]
[null,78,9,"KETCHAYA ","Brayane","MG","BROSSOLETTE","MELUN",0]
[null,643,10,"HAPDEY","Antoine","MG","CH PEGUY","VERNEUIL",0]
[null,601,11,"ABDEN","Enzo","MG","CH PEGUY","VERNEUIL",0]
[null,3918,12,"BOMBAY KOY","Anthony","MG","R BONHEUR","LE CHATELET",0]
[null,1301,13,"ARAUJO","Thomas","MG","DE PISAN","PERTHES",0]
[null,1831,14,"ZEMMOURI","Benamar","MG","ELSA TRIOLET","LE MEE",0]
[null,642,15,"BOUCLY","Clément","MG","CH PEGUY","VERNEUIL",0]
[null,2415,16,"AVENEL","Kerian","MG","J AMYOT","MELUN",0]
[null,3601,17,"HUEZ","Sacha","MG","NAZARETH","VOISENON",0]
[null,1814,18,"SALABERT-FEAT","Erwan","MG","ELSA TRIOLET","LE MEE",0]
[null,1345,19,"INCANDELA","Thomas","MG","DE PISAN","PERTHES",0]
[null,904,20,"MOPIA","Mickaël","MG","CHOPIN","MELUN",0]
[null,3312,21,"DIONNET","Théo","MG","LA MARE AUX CHAMPS","VAUX",0]
[null,3337,22,"MARTIN","Aléxis","MG","LA MARE AUX CHAMPS","VAUX",0]
[null,602,23,"KASTELLER","Corentin","MG","CH PEGUY","VERNEUIL",0]
[null,3304,24,"AUBINEAU","Dorian","MG","LA MARE AUX CHAMPS","VAUX",0]
[null,1517,25,"MATHIEU","Maxence","CG","DOISNEAU","DAMMARIE",0]
[null,3936,26,"TASSIN","LOUIS","MG","R BONHEUR","LE CHATELET",0]
[null,3305,27,"SCHWOERER","Aymeri","MG","LA MARE AUX CHAMPS","VAUX",0]
[null,2712,28,"BOULLET","guillaume","MG","J D'ARC","MELUN",0]
[null,645,29,"DE SOUSA","Nicolas","MG","CH PEGUY","VERNEUIL",0]
[null,2725,30,"ROGER","vianney","MG","J D'ARC","MELUN",0]
[null,1509,31,"BAKOUZOU","Quentin","MG","DOISNEAU","DAMMARIE",0]
[null,608,32,"DAMAS","Mathieu","MG","CH PEGUY","VERNEUIL",0]
[null,703,33,"TEISSIERE","Yann","MG","CH PEGUY","VERNEUIL",0]
[null,84,34,"SABRI","Adel","MG","BROSSOLETTE","MELUN",0]
[null,2414,35,"LANDEL","Arthur","CG","J AMYOT","MELUN",0]
[null,701,36,"ABAZI","Olti","MG","CH PEGUY","VERNEUIL",0]
[null,3602,37,"OULED BOUARIF","Hassan","MG","NAZARETH","VOISENON",0]
[null,648,38,"TANNEUR","Alexy","MG","CH PEGUY","VERNEUIL",0]
[null,3321,39,"KAOUA","Paul","MG","LA MARE AUX CHAMPS","VAUX",0]
[null,605,40,"MARTINEZ","Noan","MG","CH PEGUY","VERNEUIL",0]
[null,610,41,"BOISARD","Adrien","MG","CH PEGUY","VERNEUIL",0]
[null,2735,42,"BRUNEAU","esteban","MG","J D'ARC","MELUN",0]
[null,1519,43,"ANTHOUNET","Paul","MG","DOISNEAU","DAMMARIE",0]
[null,612,44,"DAMAS","Vincent","MG","CH PEGUY","VERNEUIL",0]
[null,707,45,"PERILLIER","Hugo","MG","CH PEGUY","VERNEUIL",0]
[null,3346,46,"NAVIS","MATHIEU","MG","LA MARE AUX CHAMPS","VAUX",0]
[null,null,47,"PEMBELE","EXAUCE","CG","CAPUCINS","MELUN",""]
[null,1352,48,"OUDOIRE","Hugo","MG","DE PISAN","PERTHES",0]
[null,3340,49,"SZELERSKI","Benoit","MG","LA MARE AUX CHAMPS","VAUX",0]
[null,613,50,"VOISIN","Kellian","MG","CH PEGUY","VERNEUIL",0]
[null,3933,51,"SENHADY","EVANN","MG","R BONHEUR","LE CHATELET",0]
[null,3338,52,"VOYER","Pierre","MG","LA MARE AUX CHAMPS","VAUX",0]
[null,1312,53,"MILLOT","Ulysse","MG","DE PISAN","PERTHES",0]
[null,89,54,"LAZREG","Mehdi","MG","BROSSOLETTE","MELUN",0]
[null,2732,55,"MASSON","enguérand","MG","J D'ARC","MELUN",0]
[null,2470,56,"PAWLIK","REMY","MG","J AMYOT","MELUN",0]
[null,3934,57,"ERROUAH","ISMAEL","MG","R BONHEUR","LE CHATELET",0]
[null,2413,58,"CUSINATO","Kenzo","MG","J AMYOT","MELUN",0]
[null,649,59,"JANNIC","Camille","MG","CH PEGUY","VERNEUIL",0]
[null,3622,60,"TESTE","Alexis","MG","NAZARETH","VOISENON",0]
[null,651,61,"HEYDT","Antonin","MG","CH PEGUY","VERNEUIL",0]
[null,3342,62,"BORTOT","Florian","MG","LA MARE AUX CHAMPS","VAUX",0]
[null,3927,63,"LE LAY","Martin","MG","R BONHEUR","LE CHATELET",0]
[null,309,64,"ESTEVES","Yoann","MG","CAPUCINS","MELUN",0]
[null,3311,65,{"$f":"IF($B69=\"\",\"\",LOOKUP($B69,BASE,nom))","v":"KHIAR"},{"$f":"IF($B69=\"\",\"\",LOOKUP($B69,BASE,prenom))","v":"Najib"},{"$f":"IF($B69=\"\",\"\",LOOKUP($B69,BASE,cat))","v":"MG"},{"$f":"IF($B69=\"\",\"\",LOOKUP($B69,BASE,etab))","v":"LA MARE AUX CHAMPS"},{"$f":"IF($B69=\"\",\"\",LOOKUP($B69,BASE,VILLE))","v":"VAUX"},{"$f":"IF($B69=\"\",\"\",LOOKUP($B69,BASE,Num))","v":0}]
[null,3928,66,"COSTANO","PABLO","MG","R BONHEUR","LE CHATELET",0]
[null,3919,67,"COUDRET","Jordan","MG","R BONHEUR","LE CHATELET",0]
[null,83,68,"COULIBALY","Kandara","MG","BROSSOLETTE","MELUN",0]
[null,311,69,"GOMA","PERREL","MG","CAPUCINS","MELUN",0]
[null,1504,70,"OLUSANYA","Gabriel","MG","DOISNEAU","DAMMARIE",0]
[null,1508,71,"MESSAOUDI","Anas","MG","DOISNEAU","DAMMARIE",0]
[null,85,72,"DURSUN","Kadir","MG","BROSSOLETTE","MELUN",0]
[null,954,73,"DANO ","Christopher","MG","CHOPIN","MELUN",0]
[null,3010,74,"GATOUFI","Malek","MG","LA FONTAINE","LE MEE",0]
[null,3926,75,"ALLART","Justin","MG","R BONHEUR","LE CHATELET",0]
[null,2110,76,"GIROULT","Yoann","MG","F VILLON","PONTHIERRY",0]
[null,3609,77,"VANNIER","Baptiste","MG","NAZARETH","VOISENON",0]
[null,90,78,"METAL","Exaucé","MG","BROSSOLETTE","MELUN",0]
[null,91,79,"BARRY","Boubacar","MG","BROSSOLETTE","MELUN",0]
[null,616,80,"LE BERRE","Hugo","MG","CH PEGUY","VERNEUIL",0]
[null,659,81,"DREANO","Thibault","MG","CH PEGUY","VERNEUIL",0]
[null,2418,82,"KOULTCHENKO","Iwan","MG","J AMYOT","MELUN",0]
[null,1361,83,"POTIER","Brice","MG","DE PISAN","PERTHES",0]
[null,null,84,"","","","","",""]
[null,null,85,"","","","","",""]
[null,null,86,"","","","","",""]
[null,null,87,"","","","","",""]
[null,null,88,"","","","","",""]
[null,null,89,"","","","","",""]
[null,null,90,"","","","","",""]
[null,null,91,"","","","","",""]
[null,null,92,"","","","","",""]
[null,null,93,"","","","","",""]
[null,null,94,"","","","","",""]
[null,null,95,"","","","","",""]
[null,null,96,"","","","","",""]
[null,null,97,"","","","","",""]
[null,null,98,"","","","","",""]
[null,null,99,"","","","","",""]
[null,null,100,"","","","","",""]
[null,null,101,"","","","","",""]
[null,null,102,"","","","","",""]
[null,null,103,"","","","","",""]
[null,null,104,"","","","","",""]
[null,null,105,"","","","","",""]
[null,null,106,"","","","","",""]
[null,null,107,"","","","","",""]
[null,null,108,"","","","","",""]
[null,null,109,"","","","","",""]
[null,null,110,"","","","","",""]
[null,null,111,"","","","","",""]
[null,null,112,"","","","","",""]
[null,null,113,"","","","","",""]
[null,null,114,"","","","","",""]
[null,null,115,"","","","","",""]
[null,null,116,"","","","","",""]
[null,null,117,"","","","","",""]
[null,null,118,"","","","","",""]
[null,null,119,"","","","","",""]
[null,null,120,"","","","","",""]
[null,null,121,"","","","","",""]
[null,null,122,"","","","","",""]
[null,null,123,"","","","","",""]
[null,null,124,"","","","","",""]
[null,null,125,"","","","","",""]
[null,null,126,"","","","","",""]
[null,null,127,"","","","","",""]
[null,null,128,"","","","","",""]
[null,null,129,{"$f":"IF($B133=\"\",\"\",LOOKUP($B133,BASE,nom))","v":""},{"$f":"IF($B133=\"\",\"\",LOOKUP($B133,BASE,prenom))","v":""},{"$f":"IF($B133=\"\",\"\",LOOKUP($B133,BASE,cat))","v":""},{"$f":"IF($B133=\"\",\"\",LOOKUP($B133,BASE,etab))","v":""},{"$f":"IF($B133=\"\",\"\",LOOKUP($B133,BASE,VILLE))","v":""},{"$f":"IF($B133=\"\",\"\",LOOKUP($B133,BASE,Num))","v":""}]
[null,null,130,"","","","","",""]
[null,null,131,"","","","","",""]
[null,null,132,"","","","","",""]
[null,null,133,"","","","","",""]
[null,null,134,"","","","","",""]
[null,null,135,"","","","","",""]
[null,null,136,"","","","","",""]
[null,null,137,"","","","","",""]
[null,null,138,"","","","","",""]
[null,null,139,"","","","","",""]
[null,null,140,"","","","","",""]
[null,null,141,"","","","","",""]
[null,null,142,"","","","","",""]
[null,null,143,"","","","","",""]
[null,null,144,"","","","","",""]
[null,null,145,"","","","","",""]
[null,null,146,"","","","","",""]
[null,null,147,"","","","","",""]
[null,null,148,"","","","","",""]
[null,null,149,"","","","","",""]
[null,null,150,"","","","","",""]
[null,null,151,"","","","","",""]
[null,null,152,"","","","","",""]
[null,null,153,"","","","","",""]
[null,null,154,"","","","","",""]
[null,null,155,"","","","","",""]
[null,null,156,"","","","","",""]
[null,null,157,"","","","","",""]
[null,null,158,"","","","","",""]
[null,null,159,"","","","","",""]
[null,null,160,"","","","","",""]
[null,null,161,"","","","","",""]
[null,null,162,"","","","","",""]
[null,null,163,"","","","","",""]
[null,null,164,"","","","","",""]
[null,null,165,"","","","","",""]
[null,null,166,"","","","","",""]
[null,null,167,"","","","","",""]
[null,null,168,"","","","","",""]
[null,null,169,"","","","","",""]
[null,null,170,"","","","","",""]
[null,null,171,"","","","","",""]
[null,null,172,"","","","","",""]
[null,null,173,"","","","","",""]
[null,null,174,"","","","","",""]
[null,null,175,"","","","","",""]
[null,null,176,"","","","","",""]
[null,null,177,"","","","","",""]
[null,null,178,"","","","","",""]
[null,null,179,"","","","","",""]
[null,null,180,"","","","","",""]
[null,null,181,"","","","","",""]
[null,null,182,"","","","","",""]
[null,null,183,"","","","","",""]
[null,null,184,"","","","","",""]
[null,null,185,"","","","","",""]
[null,null,186,"","","","","",""]
[null,null,187,"","","","","",""]
[null,null,188,"","","","","",""]
[null,null,189,"","","","","",""]
[null,null,190,"","","","","",""]
[null,null,191,"","","","","",""]
[null,null,192,"","","","","",""]
[null,null,193,{"$f":"IF($B197=\"\",\"\",LOOKUP($B197,BASE,nom))","v":""},{"$f":"IF($B197=\"\",\"\",LOOKUP($B197,BASE,prenom))","v":""},{"$f":"IF($B197=\"\",\"\",LOOKUP($B197,BASE,cat))","v":""},{"$f":"IF($B197=\"\",\"\",LOOKUP($B197,BASE,etab))","v":""},{"$f":"IF($B197=\"\",\"\",LOOKUP($B197,BASE,VILLE))","v":""},{"$f":"IF($B197=\"\",\"\",LOOKUP($B197,BASE,Num))","v":""}]
[null,null,194,"","","","","",""]
[null,null,195,"","","","","",""]
[null,null,196,"","","","","",""]
[null,null,197,"","","","","",""]
[null,null,198,"","","","","",""]
[null,null,199,"","","","","",""]
[null,null,200,"","","","","",""]
[null,null,201,"","","","","",""]
[null,null,202,"","","","","",""]
[null,null,203,"","","","","",""]
[null,null,204,"","","","","",""]
[null,null,205,"","","","","",""]
[null,null,206,"","","","","",""]
[null,null,207,"","","","","",""]
[null,null,208,"","","","","",""]
[null,null,209,"","","","","",""]
[null,null,210,"","","","","",""]
[null,null,211,"","","","","",""]
[null,null,212,"","","","","",""]
[null,null,213,"","","","","",""]
[null,null,214,"","","","","",""]
[null,null,215,"","","","","",""]
[null,null,216,"","","","","",""]
[null,null,217,"","","","","",""]
[null,null,218,"","","","","",""]
[null,null,219,"","","","","",""]
[null,null,220,"","","","","",""]
[null,null,221,"","","","","",""]
[null,null,222,"","","","","",""]
[null,null,223,"","","","","",""]
[null,null,224,"","","","","",""]
[null,null,225,"","","","","",""]
[null,null,226,"","","","","",""]
[null,null,227,"","","","","",""]
[null,null,228,"","","","","",""]
[null,null,229,"","","","","",""]
[null,null,230,"","","","","",""]
[null,null,231,"","","","","",""]
[null,null,232,"","","","","",""]
[null,null,233,{"$f":"IF($B237=\"\",\"\",LOOKUP($B237,BASE,nom))","v":""},{"$f":"IF($B237=\"\",\"\",LOOKUP($B237,BASE,prenom))","v":""},{"$f":"IF($B237=\"\",\"\",LOOKUP($B237,BASE,cat))","v":""},{"$f":"IF($B237=\"\",\"\",LOOKUP($B237,BASE,etab))","v":""},{"$f":"IF($B237=\"\",\"\",LOOKUP($B237,BASE,VILLE))","v":""},{"$f":"IF($B237=\"\",\"\",LOOKUP($B237,BASE,Num))","v":""}]
[null,null,234,"","","","","",""]
[null,null,235,"","","","","",""]
[null,null,236,"","","","","",""]
[null,null,237,"","","","","",""]
[null,null,238,"","","","","",""]
[null,null,239,"","","","","",""]
[null,null,240,"","","","","",""]
[null,null,241,"","","","","",""]
[null,null,242,"","","","","",""]
[null,null,243,"","","","","",""]
[null,null,244,"","","","","",""]
[null,null,245,"","","","","",""]
[null,null,246,"","","","","",""]
[null,null,247,"","","","","",""]
[null,null,248,"","","","","",""]
[null,null,249,"","","","","",""]
[null,null,250,"","","","","",""]
[null,null,251,"","","","","",""]
[null,null,252,"","","","","",""]
[null,null,253,"","","","","",""]
[null,null,254,"","","","","",""]
[null,null,255,"","","","","",""]
[null,null,256,"","","","","",""]
[null,null,257,{"$f":"IF($B261=\"\",\"\",LOOKUP($B261,BASE,nom))","v":""},{"$f":"IF($B261=\"\",\"\",LOOKUP($B261,BASE,prenom))","v":""},{"$f":"IF($B261=\"\",\"\",LOOKUP($B261,BASE,cat))","v":""},{"$f":"IF($B261=\"\",\"\",LOOKUP($B261,BASE,etab))","v":""},{"$f":"IF($B261=\"\",\"\",LOOKUP($B261,BASE,VILLE))","v":""},{"$f":"IF($B261=\"\",\"\",LOOKUP($B261,BASE,Num))","v":""}]
[null,null,258,"","","","","",""]
[null,null,259,"","","","","",""]
[null,null,260,"","","","","",""]
[null,null,261,"","","","","",""]
[null,null,262,"","","","","",""]
[null,null,263,"","","","","",""]
[null,null,264,"","","","","",""]
[null,null,265,"","","","","",""]
[null,null,266,"","","","","",""]
[null,null,267,"","","","","",""]
[null,null,268,"","","","","",""]
[null,null,269,"","","","","",""]
[null,null,270,"","","","","",""]
[null,null,271,"","","","","",""]
[null,null,272,"","","","","",""]
[null,null,273,"","","","","",""]
[null,null,274,"","","","","",""]
[null,null,275,"","","","","",""]
[null,null,276,"","","","","",""]
[null,null,277,"","","","","",""]
[null,null,278,"","","","","",""]
[null,null,279,"","","","","",""]
[null,null,280,"","","","","",""]

{"sheet":"Classt MinG","index":12,"n_rows":284,"n_cols":7,"rows_kept":284,"cut":false,"hidden":false,"merged":[[1,0,1,6]]}
[]
["CROSS DU DISTRICT\nCLASSEMENT MINIMES GARCONS"]
[]
["PLACE","NOMS","PRENOMS","CATE","ETABLISSMENT","VILLE","Num"]
[1,"GAUBERVILLE","Arnaud","MG","DE PISAN","PERTHES",0]
[2,"NOVIER","Nathan","MG","LA MARE AUX CHAMPS","VAUX",0]
[3,"MINNITI ANDREI","Pierre","MG","DE PISAN","PERTHES",0]
[4,"WANSTER","willy","MG","J D'ARC","MELUN",0]
[5,"HORTAS","Mylan","MG","DOISNEAU","DAMMARIE",0]
[6,"GOUGET","Esteban","MG","DOISNEAU","DAMMARIE",0]
[7,"MIGNOT","Clément","MG","CH PEGUY","VERNEUIL",0]
[8,"KETCHAYA ","Brayane","MG","BROSSOLETTE","MELUN",0]
[9,"HAPDEY","Antoine","MG","CH PEGUY","VERNEUIL",0]
[10,"ABDEN","Enzo","MG","CH PEGUY","VERNEUIL",0]
[11,"BOMBAY KOY","Anthony","MG","R BONHEUR","LE CHATELET",0]
[12,"ARAUJO","Thomas","MG","DE PISAN","PERTHES",0]
[13,"ZEMMOURI","Benamar","MG","ELSA TRIOLET","LE MEE",0]
[14,"BOUCLY","Clément","MG","CH PEGUY","VERNEUIL",0]
[15,"AVENEL","Kerian","MG","J AMYOT","MELUN",0]
[16,"HUEZ","Sacha","MG","NAZARETH","VOISENON",0]
[17,"SALABERT-FEAT","Erwan","MG","ELSA TRIOLET","LE MEE",0]
[18,"INCANDELA","Thomas","MG","DE PISAN","PERTHES",0]
[19,"MOPIA","Mickaël","MG","CHOPIN","MELUN",0]
[20,"DIONNET","Théo","MG","LA MARE AUX CHAMPS","VAUX",0]
[21,"MARTIN","Aléxis","MG","LA MARE AUX CHAMPS","VAUX",0]
[22,"KASTELLER","Corentin","MG","CH PEGUY","VERNEUIL",0]
[23,"AUBINEAU","Dorian","MG","LA MARE AUX CHAMPS","VAUX",0]
[24,"TASSIN","LOUIS","MG","R BONHEUR","LE CHATELET",0]
[25,"SCHWOERER","Aymeri","MG","LA MARE AUX CHAMPS","VAUX",0]
[26,"BOULLET","guillaume","MG","J D'ARC","MELUN",0]
[27,"DE SOUSA","Nicolas","MG","CH PEGUY","VERNEUIL",0]
[28,"ROGER","vianney","MG","J D'ARC","MELUN",0]
[29,"BAKOUZOU","Quentin","MG","DOISNEAU","DAMMARIE",0]
[30,"DAMAS","Mathieu","MG","CH PEGUY","VERNEUIL",0]
[31,"TEISSIERE","Yann","MG","CH PEGUY","VERNEUIL",0]
[32,"SABRI","Adel","MG","BROSSOLETTE","MELUN",0]
[33,"ABAZI","Olti","MG","CH PEGUY","VERNEUIL",0]
[34,"OULED BOUARIF","Hassan","MG","NAZARETH","VOISENON",0]
[35,"TANNEUR","Alexy","MG","CH PEGUY","VERNEUIL",0]
[36,"KAOUA","Paul","MG","LA MARE AUX CHAMPS","VAUX",0]
[37,"MARTINEZ","Noan","MG","CH PEGUY","VERNEUIL",0]
[38,"BOISARD","Adrien","MG","CH PEGUY","VERNEUIL",0]
[39,"BRUNEAU","esteban","MG","J D'ARC","MELUN",0]
[40,"ANTHOUNET","Paul","MG","DOISNEAU","DAMMARIE",0]
[41,"DAMAS","Vincent","MG","CH PEGUY","VERNEUIL",0]
[42,"PERILLIER","Hugo","MG","CH PEGUY","VERNEUIL",0]
[43,"NAVIS","MATHIEU","MG","LA MARE AUX CHAMPS","VAUX",0]
[44,"OUDOIRE","Hugo","MG","DE PISAN","PERTHES",0]
[45,"SZELERSKI","Benoit","MG","LA MARE AUX CHAMPS","VAUX",0]
[46,"VOISIN","Kellian","MG","CH PEGUY","VERNEUIL",0]
[47,"SENHADY","EVANN","MG","R BONHEUR","LE CHATELET",0]
[48,"VOYER","Pierre","MG","LA MARE AUX CHAMPS","VAUX",0]
[49,"MILLOT","Ulysse","MG","DE PISAN","PERTHES",0]
[50,"LAZREG","Mehdi","MG","BROSSOLETTE","MELUN",0]
[51,"MASSON","enguérand","MG","J D'ARC","MELUN",0]
[52,"PAWLIK","REMY","MG","J AMYOT","MELUN",0]
[53,"ERROUAH","ISMAEL","MG","R BONHEUR","LE CHATELET",0]
[54,"CUSINATO","Kenzo","MG","J AMYOT","MELUN",0]
[55,"JANNIC","Camille","MG","CH PEGUY","VERNEUIL",0]
[56,"TESTE","Alexis","MG","NAZARETH","VOISENON",0]
[57,"HEYDT","Antonin","MG","CH PEGUY","VERNEUIL",0]
[58,"BORTOT","Florian","MG","LA MARE AUX CHAMPS","VAUX",0]
[59,"LE LAY","Martin","MG","R BONHEUR","LE CHATELET",0]
[60,"ESTEVES","Yoann","MG","CAPUCINS","MELUN",0]
[61,"KHIAR","Najib","MG","LA MARE AUX CHAMPS","VAUX",0]
[62,"COSTANO","PABLO","MG","R BONHEUR","LE CHATELET",0]
[63,"COUDRET","Jordan","MG","R BONHEUR","LE CHATELET",0]
[64,"COULIBALY","Kandara","MG","BROSSOLETTE","MELUN",0]
[65,"GOMA","PERREL","MG","CAPUCINS","MELUN",0]
[66,"OLUSANYA","Gabriel","MG","DOISNEAU","DAMMARIE",0]
[67,"MESSAOUDI","Anas","MG","DOISNEAU","DAMMARIE",0]
[68,"DURSUN","Kadir","MG","BROSSOLETTE","MELUN",0]
[69,"DANO ","Christopher","MG","CHOPIN","MELUN",0]
[70,"GATOUFI","Malek","MG","LA FONTAINE","LE MEE",0]
[71,"ALLART","Justin","MG","R BONHEUR","LE CHATELET",0]
[72,"GIROULT","Yoann","MG","F VILLON","PONTHIERRY",0]
[73,"VANNIER","Baptiste","MG","NAZARETH","VOISENON",0]
[74,"METAL","Exaucé","MG","BROSSOLETTE","MELUN",0]
[75,"BARRY","Boubacar","MG","BROSSOLETTE","MELUN",0]
[76,"LE BERRE","Hugo","MG","CH PEGUY","VERNEUIL",0]
[77,"DREANO","Thibault","MG","CH PEGUY","VERNEUIL",0]
[78,"KOULTCHENKO","Iwan","MG","J AMYOT","MELUN",0]
[79,"POTIER","Brice","MG","DE PISAN","PERTHES",0]
[80,"","","","","",""]
[81,"","","","","",""]
[82,"","","","","",""]
[83,"","","","","",""]
[84,"","","","","",""]
[85,"","","","","",""]
[86,"","","","","",""]
[87,"","","","","",""]
[88,"","","","","",""]
[89,"","","","","",""]
[90,"","","","","",""]
[91,"","","","","",""]
[92,"","","","","",""]
[93,"","","","","",""]
[94,"","","","","",""]
[95,"","","","","",""]
[96,"","","","","",""]
[97,"","","","","",""]
[98,"","","","","",""]
[99,"","","","","",""]
[100,"","","","","",""]
[101,"","","","","",""]
[102,"","","","","",""]
[103,"","","","","",""]
[104,"","","","","",""]
[105,"","","","","",""]
[106,"","","","","",""]
[107,"","","","","",""]
[108,"","","","","",""]
[109,"","","","","",""]
[110,"","","","","",""]
[111,"","","","","",""]
[112,"","","","","",""]
[113,"","","","","",""]
[114,"","","","","",""]
[115,"","","","","",""]
[116,"","","","","",""]
[117,"","","","","",""]
[118,"","","","","",""]
[119,"","","","","",""]
[120,"","","","","",""]
[121,"","","","","",""]
[122,"","","","","",""]
[123,"","","","","",""]
[124,"","","","","",""]
[125,"","","","","",""]
[126,"","","","","",""]
[127,"","","","","",""]
[128,"","","","","",""]
[129,"","","","","",""]
[130,"","","","","",""]
[131,"","","","","",""]
[132,"","","","","",""]
[133,"","","","","",""]
[134,"","","","","",""]
[135,"","","","","",""]
[136,"","","","","",""]
[137,"","","","","",""]
[138,"","","","","",""]
[139,"","","","","",""]
[140,"","","","","",""]
[141,"","","","","",""]
[142,"","","","","",""]
[143,"","","","","",""]
[144,"","","","","",""]
[145,"","","","","",""]
[146,"","","","","",""]
[147,"","","","","",""]
[148,"","","","","",""]
[149,"","","","","",""]
[150,"","","","","",""]
[151,"","","","","",""]
[152,"","","","","",""]
[153,"","","","","",""]
[154,"","","","","",""]
[155,"","","","","",""]
[156,"","","","","",""]
[157,"","","","","",""]
[158,"","","","","",""]
[159,"","","","","",""]
[160,"","","","","",""]
[161,"","","","","",""]
[162,"","","","","",""]
[163,"","","","","",""]
[164,"","","","","",""]
[165,"","","","","",""]
[166,"","","","","",""]
[167,"","","","","",""]
[168,"","","","","",""]
[169,"","","","","",""]
[170,"","","","","",""]
[171,"","","","","",""]
[172,"","","","","",""]
[173,"","","","","",""]
[174,"","","","","",""]
[175,"","","","","",""]
[176,"","","","","",""]
[177,"","","","","",""]
[178,"","","","","",""]
[179,"","","","","",""]
[180,"","","","","",""]
[181,"","","","","",""]
[182,"","","","","",""]
[183,"","","","","",""]
[184,"","","","","",""]
[185,"","","","","",""]
[186,"","","","","",""]
[187,"","","","","",""]
[188,"","","","","",""]
[189,"","","","","",""]
[190,"","","","","",""]
[191,"","","","","",""]
[192,"","","","","",""]
[193,"","","","","",""]
[194,"","","","","",""]
[195,"","","","","",""]
[196,"","","","","",""]
[197,"","","","","",""]
[198,"","","","","",""]
[199,"","","","","",""]
[200,"","","","","",""]
[201,"","","","","",""]
[202,"","","","","",""]
[203,"","","","","",""]
[204,"","","","","",""]
[205,"","","","","",""]
[206,"","","","","",""]
[207,"","","","","",""]
[208,"","","","","",""]
[209,"","","","","",""]
[210,"","","","","",""]
[211,"","","","","",""]
[212,"","","","","",""]
[213,"","","","","",""]
[214,"","","","","",""]
[215,"","","","","",""]
[216,"","","","","",""]
[217,"","","","","",""]
[218,"","","","","",""]
[219,"","","","","",""]
[220,"","","","","",""]
[221,"","","","","",""]
[222,"","","","","",""]
[223,"","","","","",""]
[224,"","","","","",""]
[225,"","","","","",""]
[226,"","","","","",""]
[227,"","","","","",""]
[228,"","","","","",""]
[229,"","","","","",""]
[230,"","","","","",""]
[231,"","","","","",""]
[232,"","","","","",""]
[233,"","","","","",""]
[234,"","","","","",""]
[235,"","","","","",""]
[236,"","","","","",""]
[237,"","","","","",""]
[238,"","","","","",""]
[239,"","","","","",""]
[240,"","","","","",""]
[241,"","","","","",""]
[242,"","","","","",""]
[243,"","","","","",""]
[244,"","","","","",""]
[245,"","","","","",""]
[246,"","","","","",""]
[247,"","","","","",""]
[248,"","","","","",""]
[249,"","","","","",""]
[250,"","","","","",""]
[251,"","","","","",""]
[252,"","","","","",""]
[253,"","","","","",""]
[254,"","","","","",""]
[255,"","","","","",""]
[256,"","","","","",""]
[257,"","","","","",""]
[258,"","","","","",""]
[259,"","","","","",""]
[260,"","","","","",""]
[261,"","","","","",""]
[262,"","","","","",""]
[263,"","","","","",""]
[264,"","","","","",""]
[265,"","","","","",""]
[266,"","","","","",""]
[267,"","","","","",""]
[268,"","","","","",""]
[269,"","","","","",""]
[270,"","","","","",""]
[271,"","","","","",""]
[272,"","","","","",""]
[273,"","","","","",""]
[274,"","","","","",""]
[275,"","","","","",""]
[276,"","","","","",""]
[277,"","","","","",""]
[278,"","","","","",""]
[279,"","","","","",""]
[280,"","","","","",""]

{"sheet":"Classt Cadets G","index":13,"n_rows":284,"n_cols":8,"rows_kept":284,"cut":false,"hidden":false,"merged":[[1,0,1,6]]}
[]
["CROSS DU DISTRICT\nCLASSEMENT CADETS GARCONS"]
[]
["PLACE","NOMS","PRENOMS","CATE","ETABLISSEMENT","VILLE","Num"]
[1,"LANDEL","Arthur","CG","J AMYOT","MELUN",0,""]
[2,"MATHIEU","Maxence","CG","DOISNEAU","DAMMARIE",0]
[3,"LANDEL","Arthur","CG","J AMYOT","MELUN",0]
[4,"PEMBELE","EXAUCE","CG","CAPUCINS","MELUN",""]
[5,"","","","","",""]
[6,"","","","","",""]
[7,"","","","","",""]
[8,"","","","","",""]
[9,"","","","","",""]
[10,"","","","","",""]
[11,"","","","","",""]
[12,"","","","","",""]
[13,"","","","","",""]
[14,"","","","","",""]
[15,"","","","","",""]
[16,"","","","","",""]
[17,"","","","","",""]
[18,"","","","","",""]
[19,"","","","","",""]
[20,"","","","","",""]
[21,"","","","","",""]
[22,"","","","","",""]
[23,"","","","","",""]
[24,"","","","","",""]
[25,"","","","","",""]
[26,"","","","","",""]
[27,"","","","","",""]
[28,"","","","","",""]
[29,"","","","","",""]
[30,"","","","","",""]
[31,"","","","","",""]
[32,"","","","","",""]
[33,"","","","","",""]
[34,"","","","","",""]
[35,"","","","","",""]
[36,"","","","","",""]
[37,"","","","","",""]
[38,"","","","","",""]
[39,"","","","","",""]
[40,"","","","","",""]
[41,"","","","","",""]
[42,"","","","","",""]
[43,"","","","","",""]
[44,"","","","","",""]
[45,"","","","","",""]
[46,"","","","","",""]
[47,"","","","","",""]
[48,"","","","","",""]
[49,"","","","","",""]
[50,"","","","","",""]
[51,"","","","","",""]
[52,"","","","","",""]
[53,"","","","","",""]
[54,"","","","","",""]
[55,"","","","","",""]
[56,"","","","","",""]
[57,"","","","","",""]
[58,"","","","","",""]
[59,"","","","","",""]
[60,"","","","","",""]
[61,"","","","","",""]
[62,"","","","","",""]
[63,"","","","","",""]
[64,"","","","","",""]
[65,"","","","","",""]
[66,"","","","","",""]
[67,"","","","","",""]
[68,"","","","","",""]
[69,"","","","","",""]
[70,"","","","","",""]
[71,"","","","","",""]
[72,"","","","","",""]
[73,"","","","","",""]
[74,"","","","","",""]
[75,"","","","","",""]
[76,"","","","","",""]
[77,"","","","","",""]
[78,"","","","","",""]
[79,"","","","","",""]
[80,"","","","","",""]
[81,"","","","","",""]
[82,"","","","","",""]
[83,"","","","","",""]
[84,"","","","","",""]
[85,"","","","","",""]
[86,"","","","","",""]
[87,"","","","","",""]
[88,"","","","","",""]
[89,"","","","","",""]
[90,"","","","","",""]
[91,"","","","","",""]
[92,"","","","","",""]
[93,"","","","","",""]
[94,"","","","","",""]
[95,"","","","","",""]
[96,"","","","","",""]
[97,"","","","","",""]
[98,"","","","","",""]
[99,"","","","","",""]
[100,"","","","","",""]
[101,"","","","","",""]
[102,"","","","","",""]
[103,"","","","","",""]
[104,"","","","","",""]
[105,"","","","","",""]
[106,"","","","","",""]
[107,"","","","","",""]
[108,"","","","","",""]
[109,"","","","","",""]
[110,"","","","","",""]
[111,"","","","","",""]
[112,"","","","","",""]
[113,"","","","","",""]
[114,"","","","","",""]
[115,"","","","","",""]
[116,"","","","","",""]
[117,"","","","","",""]
[118,"","","","","",""]
[119,"","","","","",""]
[120,"","","","","",""]
[121,"","","","","",""]
[122,"","","","","",""]
[123,"","","","","",""]
[124,"","","","","",""]
[125,"","","","","",""]
[126,"","","","","",""]
[127,"","","","","",""]
[128,"","","","","",""]
[129,"","","","","",""]
[130,"","","","","",""]
[null,"","","","","",""]
[null,"","","","","",""]
[null,"","","","","",""]
[null,"","","","","",""]
[null,"","","","","",""]
[null,"","","","","",""]
[null,"","","","","",""]
[null,"","","","","",""]
[null,"","","","","",""]
[null,"","","","","",""]
[null,"","","","","",""]
[null,"","","","","",""]
[null,"","","","","",""]
[null,"","","","","",""]
[null,"","","","","",""]
[null,"","","","","",""]
[null,"","","","","",""]
[null,"","","","","",""]
[null,"","","","","",""]
[null,"","","","","",""]
[null,"","","","","",""]
[null,"","","","","",""]
[null,"","","","","",""]
[null,"","","","","",""]
[null,"","","","","",""]
[null,"","","","","",""]
[null,"","","","","",""]
[null,"","","","","",""]
[null,"","","","","",""]
[null,"","","","","",""]
[null,"","","","","",""]
[null,"","","","","",""]
[null,"","","","","",""]
[null,"","","","","",""]
[null,"","","","","",""]
[null,"","","","","",""]
[null,"","","","","",""]
[null,"","","","","",""]
[null,"","","","","",""]
[null,"","","","","",""]
[null,"","","","","",""]
[null,"","","","","",""]
[null,"","","","","",""]
[null,"","","","","",""]
[null,"","","","","",""]
[null,"","","","","",""]
[null,"","","","","",""]
[null,"","","","","",""]
[null,"","","","","",""]
[null,"","","","","",""]
[null,"","","","","",""]
[null,"","","","","",""]
[null,"","","","","",""]
[null,"","","","","",""]
[null,"","","","","",""]
[null,"","","","","",""]
[null,"","","","","",""]
[null,"","","","","",""]
[null,"","","","","",""]
[null,"","","","","",""]
[null,"","","","","",""]
[null,"","","","","",""]
[null,"","","","","",""]
[null,"","","","","",""]
[null,"","","","","",""]
[null,"","","","","",""]
[null,"","","","","",""]
[null,"","","","","",""]
[null,"","","","","",""]
[null,"","","","","",""]
[null,"","","","","",""]
[null,"","","","","",""]
[null,"","","","","",""]
[null,"","","","","",""]
[null,"","","","","",""]
[null,"","","","","",""]
[null,"","","","","",""]
[null,"","","","","",""]
[null,"","","","","",""]
[null,"","","","","",""]
[null,"","","","","",""]
[null,"","","","","",""]
[null,"","","","","",""]
[null,"","","","","",""]
[null,"","","","","",""]
[null,"","","","","",""]
[null,"","","","","",""]
[null,"","","","","",""]
[null,"","","","","",""]
[null,"","","","","",""]
[null,"","","","","",""]
[null,"","","","","",""]
[null,"","","","","",""]
[null,"","","","","",""]
[null,"","","","","",""]
[null,"","","","","",""]
[null,"","","","","",""]
[null,"","","","","",""]
[null,"","","","","",""]
[null,"","","","","",""]
[null,"","","","","",""]
[null,"","","","","",""]
[null,"","","","","",""]
[null,"","","","","",""]
[null,"","","","","",""]
[null,"","","","","",""]
[null,"","","","","",""]
[null,"","","","","",""]
[null,"","","","","",""]
[null,"","","","","",""]
[null,"","","","","",""]
[null,"","","","","",""]
[null,"","","","","",""]
[null,"","","","","",""]
[null,"","","","","",""]
[null,"","","","","",""]
[null,"","","","","",""]
[null,"","","","","",""]
[null,"","","","","",""]
[null,"","","","","",""]
[null,"","","","","",""]
[null,"","","","","",""]
[null,"","","","","",""]
[null,"","","","","",""]
[null,"","","","","",""]
[null,"","","","","",""]
[null,"","","","","",""]
[null,"","","","","",""]
[null,"","","","","",""]
[null,"","","","","",""]
[null,"","","","","",""]
[null,"","","","","",""]
[null,"","","","","",""]
[null,"","","","","",""]
[null,"","","","","",""]
[null,"","","","","",""]
[null,"","","","","",""]
[null,"","","","","",""]
[null,"","","","","",""]
[null,"","","","","",""]
[null,"","","","","",""]
[null,"","","","","",""]
[null,"","","","","",""]
[null,"","","","","",""]
[null,"","","","","",""]
[null,"","","","","",""]
[null,"","","","","",""]
[null,"","","","","",""]
[null,"","","","","",""]
[null,"","","","","",""]

{"sheet":"Macro MinG","index":14,"n_rows":291,"n_cols":25,"rows_kept":291,"cut":false,"hidden":false,"merged":[[0,0,0,3]]}
["FONCTIONNEMENT DE LA MACRO"]
[1,"COLLER LES RESULTATS DANS LE TABLEAU DE GAUCHE"]
[2,"COPIER LA FORMULE",null,null,"=SI($D12=\"MG\";D12;\"\")"]
[]
[3,"FAIRE  UN COPIER COLLER DES VALEURS AVEC UN COLLAGE SPECIALE \"VALEURS\""]
[4,"Faire un trie ZA pour BF1 et bf2"]
[5,"coller dans la feuille "]
[]
[]
[]
["PLACES","NOMS","PRENOMS","CATE","ETABLISSEMENT","VILLE","N°",null,"PLACES","NOMS","PRENOMS","CATE","ETABLISSEMENT","VILLE","N°",null,null,null,"PLACES","NOMS","PRENOMS","CATE","ETABLISSEMENT","VILLE","N°"]
[1,"GAUBERVILLE","Arnaud","MG","DE PISAN","PERTHES",0,null,1,"GAUBERVILLE","Arnaud","MG","DE PISAN","PERTHES",0,null,null,"",6,"LANDEL","Arthur","CG","J AMYOT","MELUN",0]
[2,"NOVIER","Nathan","MG","LA MARE AUX CHAMPS","VAUX",0,null,2,"NOVIER","Nathan","MG","LA MARE AUX CHAMPS","VAUX",0,null,null,"",25,"MATHIEU","Maxence","CG","DOISNEAU","DAMMARIE",0]
[3,"MINNITI ANDREI","Pierre","MG","DE PISAN","PERTHES",0,null,3,"MINNITI ANDREI","Pierre","MG","DE PISAN","PERTHES",0,null,null,"",35,"LANDEL","Arthur","CG","J AMYOT","MELUN",0]
[4,"WANSTER","willy","MG","J D'ARC","MELUN",0,null,4,"WANSTER","willy","MG","J D'ARC","MELUN",0,null,null,"",47,"PEMBELE","EXAUCE","CG","CAPUCINS","MELUN",""]
[5,"HORTAS","Mylan","MG","DOISNEAU","DAMMARIE",0,null,5,"HORTAS","Mylan","MG","DOISNEAU","DAMMARIE",0,null,null,"","","","","","","",""]
[6,"LANDEL","Arthur","CG","J AMYOT","MELUN",0,null,7,"GOUGET","Esteban","MG","DOISNEAU","DAMMARIE",0,null,null,"","","","","","","",""]
[7,"GOUGET","Esteban","MG","DOISNEAU","DAMMARIE",0,null,8,"MIGNOT","Clément","MG","CH PEGUY","VERNEUIL",0,null,null,"","","","","","","",""]
[8,"MIGNOT","Clément","MG","CH PEGUY","VERNEUIL",0,null,9,"KETCHAYA ","Brayane","MG","BROSSOLETTE","MELUN",0,null,null,"","","","","","","",""]
[9,"KETCHAYA ","Brayane","MG","BROSSOLETTE","MELUN",0,null,10,"HAPDEY","Antoine","MG","CH PEGUY","VERNEUIL",0,null,null,"","","","","","","",""]
[10,"HAPDEY","Antoine","MG","CH PEGUY","VERNEUIL",0,null,11,"ABDEN","Enzo","MG","CH PEGUY","VERNEUIL",0,null,null,"","","","","","","",""]
[11,"ABDEN","Enzo","MG","CH PEGUY","VERNEUIL",0,null,12,"BOMBAY KOY","Anthony","MG","R BONHEUR","LE CHATELET",0,null,null,"","","","","","","",""]
[12,"BOMBAY KOY","Anthony","MG","R BONHEUR","LE CHATELET",0,null,13,"ARAUJO","Thomas","MG","DE PISAN","PERTHES",0,null,null,"","","","","","","",""]
[13,"ARAUJO","Thomas","MG","DE PISAN","PERTHES",0,null,14,"ZEMMOURI","Benamar","MG","ELSA TRIOLET","LE MEE",0,null,"","","","","","","","",""]
[14,"ZEMMOURI","Benamar","MG","ELSA TRIOLET","LE MEE",0,null,15,"BOUCLY","Clément","MG","CH PEGUY","VERNEUIL",0,null,null,"","","","","","","",""]
[15,"BOUCLY","Clément","MG","CH PEGUY","VERNEUIL",0,null,16,"AVENEL","Kerian","MG","J AMYOT","MELUN",0,null,null,"","","","","","","",""]
[16,"AVENEL","Kerian","MG","J AMYOT","MELUN",0,null,17,"HUEZ","Sacha","MG","NAZARETH","VOISENON",0,null,null,"","","","","","","",""]
[17,"HUEZ","Sacha","MG","NAZARETH","VOISENON",0,null,18,"SALABERT-FEAT","Erwan","MG","ELSA TRIOLET","LE MEE",0,null,null,"","","","","","","",""]
[18,"SALABERT-FEAT","Erwan","MG","ELSA TRIOLET","LE MEE",0,null,19,"INCANDELA","Thomas","MG","DE PISAN","PERTHES",0,null,null,"","","","","","","",""]
[19,"INCANDELA","Thomas","MG","DE PISAN","PERTHES",0,null,20,"MOPIA","Mickaël","MG","CHOPIN","MELUN",0,null,null,"","","","","","","",""]
[20,"MOPIA","Mickaël","MG","CHOPIN","MELUN",0,null,21,"DIONNET","Théo","MG","LA MARE AUX CHAMPS","VAUX",0,null,null,null,"","","","","","",""]
[21,"DIONNET","Théo","MG","LA MARE AUX CHAMPS","VAUX",0,null,22,"MARTIN","Aléxis","MG","LA MARE AUX CHAMPS","VAUX",0,null,null,null,"","","","","","",""]
[22,"MARTIN","Aléxis","MG","LA MARE AUX CHAMPS","VAUX",0,null,23,"KASTELLER","Corentin","MG","CH PEGUY","VERNEUIL",0,null,null,null,"","","","","","",""]
[23,"KASTELLER","Corentin","MG","CH PEGUY","VERNEUIL",0,null,24,"AUBINEAU","Dorian","MG","LA MARE AUX CHAMPS","VAUX",0,null,null,null,"","","","","","",""]
[24,"AUBINEAU","Dorian","MG","LA MARE AUX CHAMPS","VAUX",0,null,26,"TASSIN","LOUIS","MG","R BONHEUR","LE CHATELET",0,null,null,null,"","","","","","",""]
[25,"MATHIEU","Maxence","CG","DOISNEAU","DAMMARIE",0,null,27,"SCHWOERER","Aymeri","MG","LA MARE AUX CHAMPS","VAUX",0,null,null,null,"","","","","","",""]
[26,"TASSIN","LOUIS","MG","R BONHEUR","LE CHATELET",0,null,28,"BOULLET","guillaume","MG","J D'ARC","MELUN",0,null,null,null,"","","","","","",""]
[27,"SCHWOERER","Aymeri","MG","LA MARE AUX CHAMPS","VAUX",0,null,29,"DE SOUSA","Nicolas","MG","CH PEGUY","VERNEUIL",0,null,null,null,"","","","","","",""]
[28,"BOULLET","guillaume","MG","J D'ARC","MELUN",0,null,30,"ROGER","vianney","MG","J D'ARC","MELUN",0,null,null,null,"","","","","","",""]
[29,"DE SOUSA","Nicolas","MG","CH PEGUY","VERNEUIL",0,null,31,"BAKOUZOU","Quentin","MG","DOISNEAU","DAMMARIE",0,null,null,null,"","","","","","",""]
[30,"ROGER","vianney","MG","J D'ARC","MELUN",0,null,32,"DAMAS","Mathieu","MG","CH PEGUY","VERNEUIL",0,null,null,null,"","","","","","",""]
[31,"BAKOUZOU","Quentin","MG","DOISNEAU","DAMMARIE",0,null,33,"TEISSIERE","Yann","MG","CH PEGUY","VERNEUIL",0,null,null,null,"","","","","","",""]
[32,"DAMAS","Mathieu","MG","CH PEGUY","VERNEUIL",0,null,34,"SABRI","Adel","MG","BROSSOLETTE","MELUN",0,null,null,null,"","","","","","",""]
[33,"TEISSIERE","Yann","MG","CH PEGUY","VERNEUIL",0,null,36,"ABAZI","Olti","MG","CH PEGUY","VERNEUIL",0,null,null,null,"","","","","","",""]
[34,"SABRI","Adel","MG","BROSSOLETTE","MELUN",0,null,37,"OULED BOUARIF","Hassan","MG","NAZARETH","VOISENON",0,null,null,null,"","","","","","",""]
[35,"LANDEL","Arthur","CG","J AMYOT","MELUN",0,null,38,"TANNEUR","Alexy","MG","CH PEGUY","VERNEUIL",0,null,null,null,"","","","","","",""]
[36,"ABAZI","Olti","MG","CH PEGUY","VERNEUIL",0,null,39,"KAOUA","Paul","MG","LA MARE AUX CHAMPS","VAUX",0,null,null,null,"","","","","","",""]
[37,"OULED BOUARIF","Hassan","MG","NAZARETH","VOISENON",0,null,40,"MARTINEZ","Noan","MG","CH PEGUY","VERNEUIL",0,null,null,null,"","","","","","",""]
[38,"TANNEUR","Alexy","MG","CH PEGUY","VERNEUIL",0,null,41,"BOISARD","Adrien","MG","CH PEGUY","VERNEUIL",0,null,null,"","","","","","","",""]
[39,"KAOUA","Paul","MG","LA MARE AUX CHAMPS","VAUX",0,null,42,"BRUNEAU","esteban","MG","J D'ARC","MELUN",0,null,null,"","","","","","","",""]
[40,"MARTINEZ","Noan","MG","CH PEGUY","VERNEUIL",0,null,43,"ANTHOUNET","Paul","MG","DOISNEAU","DAMMARIE",0,null,null,"","","","","","","",""]
[41,"BOISARD","Adrien","MG","CH PEGUY","VERNEUIL",0,null,44,"DAMAS","Vincent","MG","CH PEGUY","VERNEUIL",0,null,null,null,"","","","","","",""]
[42,"BRUNEAU","esteban","MG","J D'ARC","MELUN",0,null,45,"PERILLIER","Hugo","MG","CH PEGUY","VERNEUIL",0,null,null,null,"","","","","","",""]
[43,"ANTHOUNET","Paul","MG","DOISNEAU","DAMMARIE",0,null,46,"NAVIS","MATHIEU","MG","LA MARE AUX CHAMPS","VAUX",0,null,null,null,"","","","","","",""]
[44,"DAMAS","Vincent","MG","CH PEGUY","VERNEUIL",0,null,48,"OUDOIRE","Hugo","MG","DE PISAN","PERTHES",0,null,null,null,"","","","","","",""]
[45,"PERILLIER","Hugo","MG","CH PEGUY","VERNEUIL",0,null,49,"SZELERSKI","Benoit","MG","LA MARE AUX CHAMPS","VAUX",0,null,null,null,"","","","","","",""]
[46,"NAVIS","MATHIEU","MG","LA MARE AUX CHAMPS","VAUX",0,null,50,"VOISIN","Kellian","MG","CH PEGUY","VERNEUIL",0,null,null,null,"","","","","","",""]
[47,"PEMBELE","EXAUCE","CG","CAPUCINS","MELUN","",null,51,"SENHADY","EVANN","MG","R BONHEUR","LE CHATELET",0,null,null,null,"","","","","","",""]
[48,"OUDOIRE","Hugo","MG","DE PISAN","PERTHES",0,null,52,"VOYER","Pierre","MG","LA MARE AUX CHAMPS","VAUX",0,null,null,null,"","","","","","",""]
[49,"SZELERSKI","Benoit","MG","LA MARE AUX CHAMPS","VAUX",0,null,53,"MILLOT","Ulysse","MG","DE PISAN","PERTHES",0,null,null,null,"","","","","","",""]
[50,"VOISIN","Kellian","MG","CH PEGUY","VERNEUIL",0,null,54,"LAZREG","Mehdi","MG","BROSSOLETTE","MELUN",0,null,null,null,"","","","","","",""]
[51,"SENHADY","EVANN","MG","R BONHEUR","LE CHATELET",0,null,55,"MASSON","enguérand","MG","J D'ARC","MELUN",0,null,null,null,"","","","","","",""]
[52,"VOYER","Pierre","MG","LA MARE AUX CHAMPS","VAUX",0,null,56,"PAWLIK","REMY","MG","J AMYOT","MELUN",0,null,null,null,"","","","","","",""]
[53,"MILLOT","Ulysse","MG","DE PISAN","PERTHES",0,null,57,"ERROUAH","ISMAEL","MG","R BONHEUR","LE CHATELET",0,null,null,"","","","","","","",""]
[54,"LAZREG","Mehdi","MG","BROSSOLETTE","MELUN",0,null,58,"CUSINATO","Kenzo","MG","J AMYOT","MELUN",0,null,null,"","","","","","","",""]
[55,"MASSON","enguérand","MG","J D'ARC","MELUN",0,null,59,"JANNIC","Camille","MG","CH PEGUY","VERNEUIL",0,null,null,"","","","","","","",""]
[56,"PAWLIK","REMY","MG","J AMYOT","MELUN",0,null,60,"TESTE","Alexis","MG","NAZARETH","VOISENON",0,null,null,"","","","","","","",""]
[57,"ERROUAH","ISMAEL","MG","R BONHEUR","LE CHATELET",0,null,61,"HEYDT","Antonin","MG","CH PEGUY","VERNEUIL",0,null,null,"","","","","","","",""]
[58,"CUSINATO","Kenzo","MG","J AMYOT","MELUN",0,null,62,"BORTOT","Florian","MG","LA MARE AUX CHAMPS","VAUX",0,null,null,"","","","","","","",""]
[59,"JANNIC","Camille","MG","CH PEGUY","VERNEUIL",0,null,63,"LE LAY","Martin","MG","R BONHEUR","LE CHATELET",0,null,null,"","","","","","","",""]
[60,"TESTE","Alexis","MG","NAZARETH","VOISENON",0,null,64,"ESTEVES","Yoann","MG","CAPUCINS","MELUN",0,null,null,"","","","","","","",""]
[61,"HEYDT","Antonin","MG","CH PEGUY","VERNEUIL",0,null,65,"KHIAR","Najib","MG","LA MARE AUX CHAMPS","VAUX",0,null,null,"","","","","","","",""]
[62,"BORTOT","Florian","MG","LA MARE AUX CHAMPS","VAUX",0,null,66,"COSTANO","PABLO","MG","R BONHEUR","LE CHATELET",0,null,null,"","","","","","","",""]
[63,"LE LAY","Martin","MG","R BONHEUR","LE CHATELET",0,null,67,"COUDRET","Jordan","MG","R BONHEUR","LE CHATELET",0,null,null,"","","","","","","",""]
[64,"ESTEVES","Yoann","MG","CAPUCINS","MELUN",0,null,68,"COULIBALY","Kandara","MG","BROSSOLETTE","MELUN",0,null,null,"","","","","","","",""]
[65,"KHIAR","Najib","MG","LA MARE AUX CHAMPS","VAUX",0,null,69,"GOMA","PERREL","MG","CAPUCINS","MELUN",0,null,null,"","","","","","","",""]
[66,"COSTANO","PABLO","MG","R BONHEUR","LE CHATELET",0,null,70,"OLUSANYA","Gabriel","MG","DOISNEAU","DAMMARIE",0,null,null,"","","","","","","",""]
[67,"COUDRET","Jordan","MG","R BONHEUR","LE CHATELET",0,null,71,"MESSAOUDI","Anas","MG","DOISNEAU","DAMMARIE",0,null,null,"","","","","","","",""]
[68,"COULIBALY","Kandara","MG","BROSSOLETTE","MELUN",0,null,72,"DURSUN","Kadir","MG","BROSSOLETTE","MELUN",0,null,null,"","","","","","","",""]
[69,"GOMA","PERREL","MG","CAPUCINS","MELUN",0,null,73,"DANO ","Christopher","MG","CHOPIN","MELUN",0,null,null,"","","","","","","",""]
[70,"OLUSANYA","Gabriel","MG","DOISNEAU","DAMMARIE",0,null,74,"GATOUFI","Malek","MG","LA FONTAINE","LE MEE",0,null,null,"","","","","","","",""]
[71,"MESSAOUDI","Anas","MG","DOISNEAU","DAMMARIE",0,null,75,"ALLART","Justin","MG","R BONHEUR","LE CHATELET",0,null,null,"","","","","","","",""]
[72,"DURSUN","Kadir","MG","BROSSOLETTE","MELUN",0,null,76,"GIROULT","Yoann","MG","F VILLON","PONTHIERRY",0,null,null,"","","","","","","",""]
[73,"DANO ","Christopher","MG","CHOPIN","MELUN",0,null,77,"VANNIER","Baptiste","MG","NAZARETH","VOISENON",0,null,null,"","","","","","","",""]
[74,"GATOUFI","Malek","MG","LA FONTAINE","LE MEE",0,null,78,"METAL","Exaucé","MG","BROSSOLETTE","MELUN",0,null,null,"","","","","","","",""]
[75,"ALLART","Justin","MG","R BONHEUR","LE CHATELET",0,null,79,"BARRY","Boubacar","MG","BROSSOLETTE","MELUN",0,null,null,"","","","","","","",""]
[76,"GIROULT","Yoann","MG","F VILLON","PONTHIERRY",0,null,80,"LE BERRE","Hugo","MG","CH PEGUY","VERNEUIL",0,null,null,"","","","","","","",""]
[77,"VANNIER","Baptiste","MG","NAZARETH","VOISENON",0,null,81,"DREANO","Thibault","MG","CH PEGUY","VERNEUIL",0,null,null,"","","","","","","",""]
[78,"METAL","Exaucé","MG","BROSSOLETTE","MELUN",0,null,82,"KOULTCHENKO","Iwan","MG","J AMYOT","MELUN",0,null,null,"","","","","","","",""]
[79,"BARRY","Boubacar","MG","BROSSOLETTE","MELUN",0,null,83,"POTIER","Brice","MG","DE PISAN","PERTHES",0,null,null,"","","","","","","",""]
[80,"LE BERRE","Hugo","MG","CH PEGUY","VERNEUIL",0,null,"","","","","","","",null,null,"","","","","","","",""]
[81,"DREANO","Thibault","MG","CH PEGUY","VERNEUIL",0,null,"","","","","","","",null,null,"","","","","","","",""]
[82,"KOULTCHENKO","Iwan","MG","J AMYOT","MELUN",0,null,"","","","","","","",null,null,"","","","","","","",""]
[83,"POTIER","Brice","MG","DE PISAN","PERTHES",0,null,"","","","","","","",null,null,"","","","","","","",""]
[84,"","","","","","",null,"","","","","","","",null,null,"","","","","","","",""]
[85,"","","","","","",null,"","","","","","","",null,null,"","","","","","","",""]
[86,"","","","","","",null,"","","","","","","",null,null,"","","","","","","",""]
[87,"","","","","","",null,"","","","","","","",null,null,"","","","","","","",""]
[88,"","","","","","",null,"","","","","","","",null,null,"","","","","","","",""]
[89,"","","","","","",null,"","","","","","","",null,null,"","","","","","","",""]
[90,"","","","","","",null,"","","","","","","",null,null,"","","","","","","",""]
[91,"","","","","","",null,"","","","","","","",null,null,"","","","","","","",""]
[92,"","","","","","",null,"","","","","","","",null,null,"","","","","","","",""]
[93,"","","","","","",null,"","","","","","","",null,null,"","","","","","","",""]
[94,"","","","","","",null,"","","","","","","",null,null,"","","","","","","",""]
[95,"","","","","","",null,"","","","","","","",null,null,"","","","","","","",""]
[96,"","","","","","",null,"","","","","","","",null,null,"","","","","","","",""]
[97,"","","","","","",null,"","","","","","","",null,null,"","","","","","","",""]
[98,"","","","","","",null,"","","","","","","",null,null,"","","","","","","",""]
[99,"","","","","","",null,"","","","","","","",null,null,"","","","","","","",""]
[100,"","","","","","",null,"","","","","","","",null,null,"","","","","","","",""]
[101,"","","","","","",null,"","","","","","","",null,null,"","","","","","","",""]
[102,"","","","","","",null,"","","","","","","",null,null,"","","","","","","",""]
[103,"","","","","","",null,"","","","","","","",null,null,"","","","","","","",""]
[104,"","","","","","",null,"","","","","","","",null,null,"","","","","","","",""]
[105,"","","","","","",null,"","","","","","","",null,null,"","","","","","","",""]
[106,"","","","","","",null,"","","","","","","",null,null,"","","","","","","",""]
[107,"","","","","","",null,"","","","","","","",null,null,"","","","","","","",""]
[108,"","","","","","",null,"","","","","","","",null,null,"","","","","","","",""]
[109,"","","","","","",null,"","","","","","","",null,null,"","","","","","","",""]
[110,"","","","","","",null,"","","","","","","",null,null,"","","","","","","",""]
[111,"","","","","","",null,"","","","","","","",null,null,"","","","","","","",""]
[112,"","","","","","",null,"","","","","","","",null,null,"","","","","","","",""]
[113,"","","","","","",null,"","","","","","","",null,null,"","","","","","","",""]
[114,"","","","","","",null,"","","","","","","",null,null,"","","","","","","",""]
[115,"","","","","","",null,"","","","","","","",null,null,"","","","","","","",""]
[116,"","","","","","",null,"","","","","","","",null,null,"","","","","","","",""]
[117,"","","","","","",null,"","","","","","","",null,null,"","","","","","","",""]
[118,"","","","","","",null,"","","","","","","",null,null,"","","","","","","",""]
[119,"","","","","","",null,"","","","","","","",null,null,"","","","","","","",""]
[120,"","","","","","",null,"","","","","","","",null,null,"","","","","","","",""]
[121,"","","","","","",null,"","","","","","","",null,null,"","","","","","","",""]
[122,"","","","","","",null,"","","","","","","",null,null,"","","","","","","",""]
[123,"","","","","","",null,"","","","","","","",null,null,"","","","","","","",""]
[124,"","","","","","",null,"","","","","","","",null,null,"","","","","","","",""]
[125,"","","","","","",null,"","","","","","","",null,null,"","","","","","","",""]
[126,"","","","","","",null,"","","","","","","",null,null,"","","","","","","",""]
[127,"","","","","","",null,"","","","","","","",null,null,"","","","","","","",""]
[128,"","","","","","",null,"","","","","","","",null,null,"","","","","","","",""]
[129,"","","","","","",null,"","","","","","","",null,null,"","","","","","","",""]
[130,"","","","","","",null,"","","","","","","",null,null,"","","","","","","",""]
[131,"","","","","","",null,"","","","","","","",null,null,null,"","","","","","",""]
[132,"","","","","","",null,"","","","","","","",null,null,null,"","","","","","",""]
[133,"","","","","","",null,"","","","","","","",null,null,null,"","","","","","",""]
[134,"","","","","","",null,"","","","","","","",null,null,null,"","","","","","",""]
[135,"","","","","","",null,"","","","","","","",null,null,null,"","","","","","",""]
[136,"","","","","","",null,"","","","","","","",null,null,null,"","","","","","",""]
[137,"","","","","","",null,"","","","","","","",null,null,null,"","","","","","",""]
[138,"","","","","","",null,"","","","","","","",null,null,null,"","","","","","",""]
[139,"","","","","","",null,"","","","","","","",null,null,null,"","","","","","",""]
[140,"","","","","","",null,"","","","","","","",null,null,null,"","","","","","",""]
[141,"","","","","","",null,"","","","","","","",null,null,null,"","","","","","",""]
[142,"","","","","","",null,"","","","","","","",null,null,null,"","","","","","",""]
[143,"","","","","","",null,"","","","","","","",null,null,null,"","","","","","",""]
[144,"","","","","","",null,"","","","","","","",null,null,null,"","","","","","",""]
[145,"","","","","","",null,"","","","","","","",null,null,null,"","","","","","",""]
[146,"","","","","","",null,"","","","","","","",null,null,null,"","","","","","",""]
[147,"","","","","","",null,"","","","","","","",null,null,null,"","","","","","",""]
[148,"","","","","","",null,"","","","","","","",null,null,null,"","","","","","",""]
[149,"","","","","","",null,"","","","","","","",null,null,null,"","","","","","",""]
[150,"","","","","","",null,"","","","","","","",null,null,null,"","","","","","",""]
[151,"","","","","","",null,"","","","","","","",null,null,null,"","","","","","",""]
[152,"","","","","","",null,"","","","","","","",null,null,null,"","","","","","",""]
[153,"","","","","","",null,"","","","","","","",null,null,null,"","","","","","",""]
[154,"","","","","","",null,"","","","","","","",null,null,null,"","","","","","",""]
[155,"","","","","","",null,"","","","","","","",null,null,null,"","","","","","",""]
[156,"","","","","","",null,"","","","","","","",null,null,null,"","","","","","",""]
[157,"","","","","","",null,"","","","","","","",null,null,null,"","","","","","",""]
[158,"","","","","","",null,"","","","","","","",null,null,null,"","","","","","",""]
[159,"","","","","","",null,"","","","","","","",null,null,null,"","","","","","",""]
[160,"","","","","","",null,"","","","","","","",null,null,null,"","","","","","",""]
[161,"","","","","","",null,"","","","","","","",null,null,null,"","","","","","",""]
[162,"","","","","","",null,"","","","","","","",null,null,null,"","","","","","",""]
[163,"","","","","","",null,"","","","","","","",null,null,null,"","","","","","",""]
[164,"","","","","","",null,"","","","","","","",null,null,null,"","","","","","",""]
[165,"","","","","","",null,"","","","","","","",null,null,null,"","","","","","",""]
[166,"","","","","","",null,"","","","","","","",null,null,null,"","","","","","",""]
[167,"","","","","","",null,"","","","","","","",null,null,null,"","","","","","",""]
[168,"","","","","","",null,"","","","","","","",null,null,null,"","","","","","",""]
[169,"","","","","","",null,"","","","","","","",null,null,null,"","","","","","",""]
[170,"","","","","","",null,"","","","","","","",null,null,null,"","","","","","",""]
[171,"","","","","","",null,"","","","","","","",null,null,null,"","","","","","",""]
[172,"","","","","","",null,"","","","","","","",null,null,null,"","","","","","",""]
[173,"","","","","","",null,"","","","","","","",null,null,null,"","","","","","",""]
[174,"","","","","","",null,"","","","","","","",null,null,null,"","","","","","",""]
[175,"","","","","","",null,"","","","","","","",null,null,null,"","","","","","",""]
[176,"","","","","","",null,"","","","","","","",null,null,null,"","","","","","",""]
[177,"","","","","","",null,"","","","","","","",null,null,null,"","","","","","",""]
[178,"","","","","","",null,"","","","","","","",null,null,null,"","","","","","",""]
[179,"","","","","","",null,"","","","","","","",null,null,null,"","","","","","",""]
[180,"","","","","","",null,"","","","","","","",null,null,null,"","","","","","",""]
[181,"","","","","","",null,"","","","","","","",null,null,null,"","","","","","",""]
[182,"","","","","","",null,"","","","","","","",null,null,null,"","","","","","",""]
[183,"","","","","","",null,"","","","","","","",null,null,null,"","","","","","",""]
[184,"","","","","","",null,"","","","","","","",null,null,null,"","","","","","",""]
[185,"","","","","","",null,"","","","","","","",null,null,null,"","","","","","",""]
[186,"","","","","","",null,"","","","","","","",null,null,null,"","","","","","",""]
[187,"","","","","","",null,"","","","","","","",null,null,null,"","","","","","",""]
[188,"","","","","","",null,"","","","","","","",null,null,null,"","","","","","",""]
[189,"","","","","","",null,"","","","","","","",null,null,null,"","","","","","",""]
[190,"","","","","","",null,"","","","","","","",null,null,null,"","","","","","",""]
[191,"","","","","","",null,"","","","","","","",null,null,null,"","","","","","",""]
[192,"","","","","","",null,"","","","","","","",null,null,null,"","","","","","",""]
[193,"","","","","","",null,"","","","","","","",null,null,null,"","","","","","",""]
[194,"","","","","","",null,"","","","","","","",null,null,null,"","","","","","",""]
[195,"","","","","","",null,"","","","","","","",null,null,null,"","","","","","",""]
[196,"","","","","","",null,"","","","","","","",null,null,null,"","","","","","",""]
[197,"","","","","","",null,"","","","","","","",null,null,null,"","","","","","",""]
[198,"","","","","","",null,"","","","","","","",null,null,null,"","","","","","",""]
[199,"","","","","","",null,"","","","","","","",null,null,null,"","","","","","",""]
[200,"","","","","","",null,"","","","","","","",null,null,null,"","","","","","",""]
[201,"","","","","","",null,"","","","","","","",null,null,null,"","","","","","",""]
[202,"","","","","","",null,"","","","","","","",null,null,null,"","","","","","",""]
[203,"","","","","","",null,"","","","","","","",null,null,null,"","","","","","",""]
[204,"","","","","","",null,"","","","","","","",null,null,null,"","","","","","",""]
[205,"","","","","","",null,"","","","","","","",null,null,null,"","","","","","",""]
[206,"","","","","","",null,"","","","","","","",null,null,null,"","","","","","",""]
[207,"","","","","","",null,"","","","","","","",null,null,null,"","","","","","",""]
[208,"","","","","","",null,"","","","","","","",null,null,null,"","","","","","",""]
[209,"","","","","","",null,"","","","","","","",null,null,null,"","","","","","",""]
[210,"","","","","","",null,"","","","","","","",null,null,null,"","","","","","",""]
[211,"","","","","","",null,"","","","","","","",null,null,null,"","","","","","",""]
[212,"","","","","","",null,"","","","","","","",null,null,null,"","","","","","",""]
[213,"","","","","","",null,"","","","","","","",null,null,null,"","","","","","",""]
[214,"","","","","","",null,"","","","","","","",null,null,null,"","","","","","",""]
[215,"","","","","","",null,"","","","","","","",null,null,null,"","","","","","",""]
[216,"","","","","","",null,"","","","","","","",null,null,null,"","","","","","",""]
[217,"","","","","","",null,"","","","","","","",null,null,null,"","","","","","",""]
[218,"","","","","","",null,"","","","","","","",null,null,null,"","","","","","",""]
[219,"","","","","","",null,"","","","","","","",null,null,null,"","","","","","",""]
[220,"","","","","","",null,"","","","","","","",null,null,null,"","","","","","",""]
[221,"","","","","","",null,"","","","","","","",null,null,null,"","","","","","",""]
[222,"","","","","","",null,"","","","","","","",null,null,null,"","","","","","",""]
[223,"","","","","","",null,"","","","","","","",null,null,null,"","","","","","",""]
[224,"","","","","","",null,"","","","","","","",null,null,null,"","","","","","",""]
[225,"","","","","","",null,"","","","","","","",null,null,null,"","","","","","",""]
[226,"","","","","","",null,"","","","","","","",null,null,null,"","","","","","",""]
[227,"","","","","","",null,"","","","","","","",null,null,null,"","","","","","",""]
[228,"","","","","","",null,"","","","","","","",null,null,null,"","","","","","",""]
[229,"","","","","","",null,"","","","","","","",null,null,null,"","","","","","",""]
[230,"","","","","","",null,"","","","","","","",null,null,null,"","","","","","",""]
[231,"","","","","","",null,"","","","","","","",null,null,null,"","","","","","",""]
[232,"","","","","","",null,"","","","","","","",null,null,null,"","","","","","",""]
[233,"","","","","","",null,"","","","","","","",null,null,null,"","","","","","",""]
[234,"","","","","","",null,"","","","","","","",null,null,null,"","","","","","",""]
[235,"","","","","","",null,"","","","","","","",null,null,null,"","","","","","",""]
[236,"","","","","","",null,"","","","","","","",null,null,null,"","","","","","",""]
[237,"","","","","","",null,"","","","","","","",null,null,null,"","","","","","",""]
[238,"","","","","","",null,"","","","","","","",null,null,null,"","","","","","",""]
[239,"","","","","","",null,"","","","","","","",null,null,null,"","","","","","",""]
[240,"","","","","","",null,"","","","","","","",null,null,null,"","","","","","",""]
[241,"","","","","","",null,"","","","","","","",null,null,null,"","","","","","",""]
[242,"","","","","","",null,"","","","","","","",null,null,null,"","","","","","",""]
[243,"","","","","","",null,"","","","","","","",null,null,null,"","","","","","",""]
[244,"","","","","","",null,"","","","","","","",null,null,null,"","","","","","",""]
[245,"","","","","","",null,"","","","","","","",null,null,null,"","","","","","",""]
[246,"","","","","","",null,"","","","","","","",null,null,null,"","","","","","",""]
[247,"","","","","","",null,"","","","","","","",null,null,null,"","","","","","",""]
[248,"","","","","","",null,"","","","","","","",null,null,null,"","","","","","",""]
[249,"","","","","","",null,"","","","","","","",null,null,null,"","","","","","",""]
[250,"","","","","","",null,"","","","","","","",null,null,null,"","","","","","",""]
[251,"","","","","","",null,"","","","","","","",null,null,null,"","","","","","",""]
[252,"","","","","","",null,"","","","","","","",null,null,null,"","","","","","",""]
[253,"","","","","","",null,"","","","","","","",null,null,null,"","","","","","",""]
[254,"","","","","","",null,"","","","","","","",null,null,null,"","","","","","",""]
[255,"","","","","","",null,"","","","","","","",null,null,null,"","","","","","",""]
[256,"","","","","","",null,"","","","","","","",null,null,null,"","","","","","",""]
[257,"","","","","","",null,"","","","","","","",null,null,null,"","","","","","",""]
[258,"","","","","","",null,"","","","","","","",null,null,null,"","","","","","",""]
[259,"","","","","","",null,"","","","","","","",null,null,null,"","","","","","",""]
[260,"","","","","","",null,"","","","","","","",null,null,null,"","","","","","",""]
[261,"","","","","","",null,"","","","","","","",null,null,null,"","","","","","",""]
[262,"","","","","","",null,"","","","","","","",null,null,null,"","","","","","",""]
[263,"","","","","","",null,"","","","","","","",null,null,null,"","","","","","",""]
[264,"","","","","","",null,"","","","","","","",null,null,null,"","","","","","",""]
[265,"","","","","","",null,"","","","","","","",null,null,null,"","","","","","",""]
[266,"","","","","","",null,"","","","","","","",null,null,null,"","","","","","",""]
[267,"","","","","","",null,"","","","","","","",null,null,null,"","","","","","",""]
[268,"","","","","","",null,"","","","","","","",null,null,null,"","","","","","",""]
[269,"","","","","","",null,"","","","","","","",null,null,null,"","","","","","",""]
[270,"","","","","","",null,"","","","","","","",null,null,null,"","","","","","",""]
[271,"","","","","","",null,"","","","","","","",null,null,null,"","","","","","",""]
[272,"","","","","","",null,"","","","","","","",null,null,null,"","","","","","",""]
[273,"","","","","","",null,"","","","","","","",null,null,null,"","","","","","",""]
[274,"","","","","","",null,"","","","","","","",null,null,null,"","","","","","",""]
[275,"","","","","","",null,"","","","","","","",null,null,null,"","","","","","",""]
[276,"","","","","","",null,"","","","","","","",null,null,null,"","","","","","",""]
[277,"","","","","","",null,"","","","","","","",null,null,null,"","","","","","",""]
[278,"","","","","","",null,"","","","","","","",null,null,null,"","","","","","",""]
[279,"","","","","","",null,"","","","","","","",null,null,null,"","","","","","",""]
[280,"","","","","","",null,"","","","","","","",null,null,null,"","","","","","",""]

{"sheet":"MacroBF","index":15,"n_rows":292,"n_cols":25,"rows_kept":292,"cut":false,"hidden":false,"merged":[[0,0,0,3]]}
["FONCTIONNEMENT DE LA MACRO"]
[1,"COLLER LES RESULTATS DANS LE TABLEAU DE GAUCHE"]
[2,"COPIER LA FORMULE",null,null,"=SI($D12=\"bf1\";D12;\"\")"]
[]
[3,"FAIRE  UN COPIER COLLER DES VALEURS AVEC UN COLLAGE SPECIALE \"VALEURS\""]
[4,"Faire un trie ZA pour BF1 et bf2"]
[5,"coller dans la feuille "]
[]
[]
[]
["PLACES","NOMS","PRENOMS","CATE","ETABLISSEMENT","VILLE","N°",null,"PLACES","NOMS","PRENOMS","CATE","ETABLISSEMENT","VILLE","N°",null,null,null,"PLACES","NOMS","PRENOMS","CATE","ETABLISSEMENT","VILLE","N°"]
[1,"","","","","","",null,"","","","","","","",null,null,null,"","","","","","",""]
[2,"","","","","","",null,"","","","","","","",null,null,null,"","","","","","",""]
[3,"","","","","","",null,"","","","","","","",null,null,null,"","","","","","",""]
[4,"","","","","","",null,"","","","","","","",null,null,null,"","","","","","",""]
[5,"","","","","","",null,"","","","","","","",null,null,null,"","","","","","",""]
[6,"","","","","","",null,"","","","","","","",null,null,null,"","","","","","",""]
[7,"","","","","","",null,"","","","","","","",null,null,null,"","","","","","",""]
[8,"","","","","","",null,"","","","","","","",null,null,null,"","","","","","",""]
[9,"","","","","","",null,"","","","","","","",null,null,null,"","","","","","",""]
[10,"","","","","","",null,"","","","","","","",null,null,null,"","","","","","",""]
[11,"","","","","","",null,"","","","","","","",null,null,null,"","","","","","",""]
[12,"","","","","","",null,"","","","","","","",null,null,null,"","","","","","",""]
[13,"","","","","","",null,"","","","","","","",null,null,null,"","","","","","",""]
[14,"","","","","","",null,"","","","","","","",null,null,null,"","","","","","",""]
[15,"","","","","","",null,"","","","","","","",null,null,null,"","","","","","",""]
[16,"","","","","","",null,"","","","","","","",null,null,null,"","","","","","",""]
[17,"","","","","","",null,"","","","","","","",null,null,null,"","","","","","",""]
[18,"","","","","","",null,"","","","","","","",null,null,null,"","","","","","",""]
[19,"","","","","","",null,"","","","","","","",null,null,"","","","","","","",""]
[20,"","","","","","",null,"","","","","","","",null,null,"","","","","","","",""]
[21,"","","","","","",null,"","","","","","","",null,null,"","","","","","","",""]
[22,"","","","","","",null,"","","","","","","",null,null,null,"","","","","","",""]
[23,"","","","","","",null,"","","","","","","",null,null,null,"","","","","","",""]
[24,"","","","","","",null,"","","","","","","",null,null,null,"","","","","","",""]
[25,"","","","","","",null,"","","","","","","",null,null,null,"","","","","","",""]
[26,"","","","","","",null,"","","","","","","",null,null,null,"","","","","","",""]
[27,"","","","","","",null,"","","","","","","",null,null,null,"","","","","","",""]
[28,"","","","","","",null,"","","","","","","",null,null,null,"","","","","","",""]
[29,"","","","","","",null,"","","","","","","",null,null,null,"","","","","","",""]
[30,"","","","","","",null,"","","","","","","",null,null,null,"","","","","","",""]
[31,"","","","","","",null,"","","","","","","",null,null,null,"","","","","","",""]
[32,"","","","","","",null,"","","","","","","",null,null,null,"","","","","","",""]
[33,"","","","","","",null,"","","","","","","",null,null,null,"","","","","","",""]
[34,"","","","","","",null,"","","","","","","",null,null,"","","","","","","",""]
[35,"","","","","","",null,"","","","","","","",null,null,"","","","","","","",""]
[36,"","","","","","",null,"","","","","","","",null,null,"","","","","","","",""]
[37,"","","","","","",null,"","","","","","","",null,null,"","","","","","","",""]
[38,"","","","","","",null,"","","","","","","",null,null,"","","","","","","",""]
[39,"","","","","","",null,"","","","","","","",null,null,"","","","","","","",""]
[40,"","","","","","",null,"","","","","","","",null,null,"","","","","","","",""]
[41,"","","","","","",null,"","","","","","","",null,null,"","","","","","","",""]
[42,"","","","","","",null,"","","","","","","",null,null,"","","","","","","",""]
[43,"","","","","","",null,"","","","","","","",null,null,"","","","","","","",""]
[44,"","","","","","",null,"","","","","","","",null,null,"","","","","","","",""]
[45,"","","","","","",null,"","","","","","","",null,null,"","","","","","","",""]
[46,"","","","","","",null,"","","","","","","",null,null,"","","","","","","",""]
[47,"","","","","","",null,"","","","","","","",null,null,"","","","","","","",""]
[48,"","","","","","",null,"","","","","","","",null,null,"","","","","","","",""]
[49,"","","","","","",null,"","","","","","","",null,null,"","","","","","","",""]
[50,"","","","","","",null,"","","","","","","",null,null,"","","","","","","",""]
[51,"","","","","","",null,"","","","","","","",null,null,"","","","","","","",""]
[52,"","","","","","",null,"","","","","","","",null,null,"","","","","","","",""]
[53,"","","","","","",null,"","","","","","","",null,null,"","","","","","","",""]
[54,"","","","","","",null,"","","","","","","",null,null,"","","","","","","",""]
[55,"","","","","","",null,"","","","","","","",null,null,"","","","","","","",""]
[56,"","","","","","",null,"","","","","","","",null,null,"","","","","","","",""]
[57,"","","","","","",null,"","","","","","","",null,"","","","","","","","",""]
[58,"","","","","","",null,"","","","","","","",null,null,"","","","","","","",""]
[59,"","","","","","",null,"","","","","","","",null,null,"","","","","","","",""]
[60,"","","","","","",null,"","","","","","","",null,null,"","","","","","","",""]
[61,"","","","","","",null,"","","","","","","",null,null,"","","","","","","",""]
[62,"","","","","","",null,"","","","","","","",null,null,"","","","","","","",""]
[63,"","","","","","",null,"","","","","","","",null,null,"","","","","","","",""]
[64,"","","","","","",null,"","","","","","","",null,null,"","","","","","","",""]
[65,"","","","","","",null,"","","","","","","",null,null,"","","","","","","",""]
[66,"","","","","","",null,"","","","","","","",null,null,"","","","","","","",""]
[67,"","","","","","",null,"","","","","","","",null,null,"","","","","","","",""]
[68,"","","","","","",null,"","","","","","","",null,null,"","","","","","","",""]
[69,"","","","","","",null,"","","","","","","",null,null,"","","","","","","",""]
[70,"","","","","","",null,"","","","","","","",null,null,"","","","","","","",""]
[71,"","","","","","",null,"","","","","","","",null,null,"","","","","","","",""]
[72,"","","","","","",null,"","","","","","","",null,null,"","","","","","","",""]
[73,"","","","","","",null,"","","","","","","",null,null,"","","","","","","",""]
[74,"","","","","","",null,"","","","","","","",null,null,"","","","","","","",""]
[75,"","","","","","",null,"","","","","","","",null,null,"","","","","","","",""]
[76,"","","","","","",null,"","","","","","","",null,null,"","","","","","","",""]
[77,"","","","","","",null,"","","","","","","",null,null,"","","","","","","",""]
[78,"","","","","","",null,"","","","","","","",null,null,"","","","","","","",""]
[79,"","","","","","",null,"","","","","","","",null,null,"","","","","","","",""]
[80,"","","","","","",null,"","","","","","","",null,null,"","","","","","","",""]
[81,"","","","","","",null,"","","","","","","",null,null,"","","","","","","",""]
[82,"","","","","","",null,"","","","","","","",null,null,"","","","","","","",""]
[83,"","","","","","",null,"","","","","","","",null,null,"","","","","","","",""]
[84,"","","","","","",null,"","","","","","","",null,null,"","","","","","","",""]
[85,"","","","","","",null,"","","","","","","",null,null,"","","","","","","",""]
[86,"","","","","","",null,"","","","","","","",null,null,"","","","","","","",""]
[87,"","","","","","",null,"","","","","","","",null,null,"","","","","","","",""]
[88,"","","","","","",null,"","","","","","","",null,null,"","","","","","","",""]
[89,"","","","","","",null,"","","","","","","",null,null,"","","","","","","",""]
[90,"","","","","","",null,"","","","","","","",null,null,"","","","","","","",""]
[91,"","","","","","",null,"","","","","","","",null,null,"","","","","","","",""]
[92,"","","","","","",null,"","","","","","","",null,null,"","","","","","","",""]
[93,"","","","","","",null,"","","","","","","",null,null,"","","","","","","",""]
[94,"","","","","","",null,"","","","","","","",null,null,"","","","","","","",""]
[95,"","","","","","",null,"","","","","","","",null,null,"","","","","","","",""]
[96,"","","","","","",null,"","","","","","","",null,null,"","","","","","","",""]
[97,"","","","","","",null,"","","","","","","",null,null,"","","","","","","",""]
[98,"","","","","","",null,"","","","","","","",null,null,"","","","","","","",""]
[99,"","","","","","",null,"","","","","","","",null,null,"","","","","","","",""]
[100,"","","","","","",null,"","","","","","","",null,null,"","","","","","","",""]
[101,"","","","","","",null,"","","","","","","",null,null,"","","","","","","",""]
[102,"","","","","","",null,"","","","","","","",null,null,"","","","","","","",""]
[103,"","","","","","",null,"","","","","","","",null,null,"","","","","","","",""]
[104,"","","","","","",null,"","","","","","","",null,null,"","","","","","","",""]
[105,"","","","","","",null,"","","","","","","",null,null,"","","","","","","",""]
[106,"","","","","","",null,"","","","","","","",null,null,"","","","","","","",""]
[107,"","","","","","",null,"","","","","","","",null,null,"","","","","","","",""]
[108,"","","","","","",null,"","","","","","","",null,null,"","","","","","","",""]
[109,"","","","","","",null,"","","","","","","",null,null,"","","","","","","",""]
[110,"","","","","","",null,"","","","","","","",null,null,"","","","","","","",""]
[111,"","","","","","",null,"","","","","","","",null,null,"","","","","","","",""]
[112,"","","","","","",null,"","","","","","","",null,null,"","","","","","","",""]
[113,"","","","","","",null,"","","","","","","",null,null,"","","","","","","",""]
[114,"","","","","",null,null,"","","","","","","",null,null,"","","","","","","",""]
[115,"","","","","","",null,"","","","","","","",null,null,"","","","","","","",""]
[116,"","","","","","",null,"","","","","","","",null,null,"","","","","","","",""]
[117,"","","","","","",null,"","","","","","","",null,null,"","","","","","","",""]
[118,"","","","","","",null,"","","","","","","",null,null,"","","","","","","",""]
[119,"","","","","","",null,"","","","","","","",null,null,"","","","","","","",""]
[120,"","","","","","",null,"","","","","","","",null,null,"","","","","","","",""]
[121,"","","","","","",null,"","","","","","","",null,null,"","","","","","","",""]
[122,"","","","","","",null,"","","","","","","",null,null,"","","","","","","",""]
[123,"","","","","","",null,"","","","","","","",null,null,"","","","","","","",""]
[124,"","","","","","",null,"","","","","","","",null,null,"","","","","","","",""]
[125,"","","","","","",null,"","","","","","","",null,null,"","","","","","","",""]
[126,"","","","","","",null,"","","","","","","",null,null,"","","","","","","",""]
[127,"","","","","","",null,"","","","","","","",null,null,"","","","","","","",""]
[128,"","","","","","",null,"","","","","","","",null,null,"","","","","","","",""]
[129,"","","","","","",null,"","","","","","","",null,null,"","","","","","","",""]
[130,"","","","","","",null,"","","","","","","",null,null,"","","","","","","",""]
[131,"","","","","","",null,"","","","","","","",null,null,null,"","","","","","",""]
[132,"","","","","","",null,"","","","","","","",null,null,null,"","","","","","",""]
[133,"","","","","","",null,"","","","","","","",null,null,null,"","","","","","",""]
[134,"","","","","","",null,"","","","","","","",null,null,null,"","","","","","",""]
[135,"","","","","","",null,"","","","","","","",null,null,null,"","","","","","",""]
[136,"","","","","","",null,"","","","","","","",null,null,null,"","","","","","",""]
[137,"","","","","","",null,"","","","","","","",null,null,null,"","","","","","",""]
[138,"","","","","","",null,"","","","","","","",null,null,null,"","","","","","",""]
[139,"","","","","","",null,"","","","","","","",null,null,null,"","","","","","",""]
[140,"","","","","","",null,"","","","","","","",null,null,null,"","","","","","",""]
[141,"","","","","","",null,"","","","","","","",null,null,null,"","","","","","",""]
[142,"","","","","","",null,"","","","","","","",null,null,null,"","","","","","",""]
[143,"","","","","","",null,"","","","","","","",null,null,null,"","","","","","",""]
[144,"","","","","","",null,"","","","","","","",null,null,null,"","","","","","",""]
[145,"","","","","","",null,"","","","","","","",null,null,null,"","","","","","",""]
[146,"","","","","","",null,"","","","","","","",null,null,null,"","","","","","",""]
[147,"","","","","","",null,"","","","","","","",null,null,null,"","","","","","",""]
[148,"","","","","","",null,"","","","","","","",null,null,null,"","","","","","",""]
[149,"","","","","","",null,"","","","","","","",null,null,null,"","","","","","",""]
[150,"","","","","","",null,"","","","","","","",null,null,null,"","","","","","",""]
[151,"","","","","","",null,"","","","","","","",null,null,null,"","","","","","",""]
[152,"","","","","","",null,"","","","","","","",null,null,null,"","","","","","",""]
[153,"","","","","","",null,"","","","","","","",null,null,null,"","","","","","",""]
[154,"","","","","","",null,"","","","","","","",null,null,null,"","","","","","",""]
[155,"","","","","","",null,"","","","","","","",null,null,null,"","","","","","",""]
[156,"","","","","","",null,"","","","","","","",null,null,null,"","","","","","",""]
[157,"","","","","","",null,"","","","","","","",null,null,null,"","","","","","",""]
[158,"","","","","","",null,"","","","","","","",null,null,null,"","","","","","",""]
[159,"","","","","","",null,"","","","","","","",null,null,null,"","","","","","",""]
[160,"","","","","","",null,"","","","","","","",null,null,null,"","","","","","",""]
[161,"","","","","","",null,"","","","","","","",null,null,null,"","","","","","",""]
[162,"","","","","","",null,"","","","","","","",null,null,null,"","","","","","",""]
[163,"","","","","","",null,"","","","","","","",null,null,null,"","","","","","",""]
[164,"","","","","","",null,"","","","","","","",null,null,null,"","","","","","",""]
[165,"","","","","","",null,"","","","","","","",null,null,null,"","","","","","",""]
[166,"","","","","","",null,"","","","","","","",null,null,null,"","","","","","",""]
[167,"","","","","","",null,"","","","","","","",null,null,null,"","","","","","",""]
[168,"","","","","","",null,"","","","","","","",null,null,null,"","","","","","",""]
[169,"","","","","","",null,"","","","","","","",null,null,null,"","","","","","",""]
[170,"","","","","","",null,"","","","","","","",null,null,null,"","","","","","",""]
[171,"","","","","","",null,"","","","","","","",null,null,null,"","","","","","",""]
[172,"","","","","","",null,"","","","","","","",null,null,null,"","","","","","",""]
[173,"","","","","","",null,"","","","","","","",null,null,null,"","","","","","",""]
[174,"","","","","","",null,"","","","","","","",null,null,null,"","","","","","",""]
[175,"","","","","","",null,"","","","","","","",null,null,null,"","","","","","",""]
[176,"","","","","","",null,"","","","","","","",null,null,null,"","","","","","",""]
[177,"","","","","","",null,"","","","","","","",null,null,null,"","","","","","",""]
[178,"","","","","","",null,"","","","","","","",null,null,null,"","","","","","",""]
[179,"","","","","","",null,"","","","","","","",null,null,null,"","","","","","",""]
[180,"","","","","","",null,"","","","","","","",null,null,null,"","","","","","",""]
[181,"","","","","","",null,"","","","","","","",null,null,null,"","","","","","",""]
[182,"","","","","","",null,"","","","","","","",null,null,null,"","","","","","",""]
[183,"","","","","","",null,"","","","","","","",null,null,null,"","","","","","",""]
[184,"","","","","","",null,"","","","","","","",null,null,null,"","","","","","",""]
[185,"","","","","","",null,"","","","","","","",null,null,null,"","","","","","",""]
[186,"","","","","","",null,"","","","","","","",null,null,null,"","","","","","",""]
[187,"","","","","","",null,"","","","","","","",null,null,null,"","","","","","",""]
[188,"","","","","","",null,"","","","","","","",null,null,null,"","","","","","",""]
[189,"","","","","","",null,"","","","","","","",null,null,null,"","","","","","",""]
[190,"","","","","","",null,"","","","","","","",null,null,null,"","","","","","",""]
[191,"","","","","","",null,"","","","","","","",null,null,null,"","","","","","",""]
[192,"","","","","","",null,"","","","","","","",null,null,null,"","","","","","",""]
[193,"","","","","","",null,"","","","","","","",null,null,null,"","","","","","",""]
[194,"","","","","","",null,"","","","","","","",null,null,null,"","","","","","",""]
[195,"","","","","","",null,"","","","","","","",null,null,null,"","","","","","",""]
[196,"","","","","","",null,"","","","","","","",null,null,null,"","","","","","",""]
[197,"","","","","","",null,"","","","","","","",null,null,null,"","","","","","",""]
[198,"","","","","","",null,"","","","","","","",null,null,null,"","","","","","",""]
[199,"","","","","","",null,"","","","","","","",null,null,null,"","","","","","",""]
[200,"","","","","","",null,"","","","","","","",null,null,null,"","","","","","",""]
[201,"","","","","","",null,"","","","","","","",null,null,null,"","","","","","",""]
[202,"","","","","","",null,"","","","","","","",null,null,null,"","","","","","",""]
[203,"","","","","","",null,"","","","","","","",null,null,null,"","","","","","",""]
[204,"","","","","","",null,"","","","","","","",null,null,null,"","","","","","",""]
[205,"","","","","","",null,"","","","","","","",null,null,null,"","","","","","",""]
[206,"","","","","","",null,"","","","","","","",null,null,null,"","","","","","",""]
[207,"","","","","","",null,"","","","","","","",null,null,null,"","","","","","",""]
[208,"","","","","","",null,"","","","","","","",null,null,null,"","","","","","",""]
[209,"","","","","","",null,"","","","","","","",null,null,null,"","","","","","",""]
[210,"","","","","","",null,"","","","","","","",null,null,null,"","","","","","",""]
[211,"","","","","","",null,"","","","","","","",null,null,null,"","","","","","",""]
[212,"","","","","","",null,"","","","","","","",null,null,null,"","","","","","",""]
[213,"","","","","","",null,"","","","","","","",null,null,null,"","","","","","",""]
[214,"","","","","","",null,"","","","","","","",null,null,null,"","","","","","",""]
[215,"","","","","","",null,"","","","","","","",null,null,null,"","","","","","",""]
[216,"","","","","","",null,"","","","","","","",null,null,null,"","","","","","",""]
[217,"","","","","","",null,"","","","","","","",null,null,null,"","","","","","",""]
[218,"","","","","","",null,"","","","","","","",null,null,null,"","","","","","",""]
[219,"","","","","","",null,"","","","","","","",null,null,null,"","","","","","",""]
[220,"","","","","","",null,"","","","","","","",null,null,null,"","","","","","",""]
[221,"","","","","","",null,"","","","","","","",null,null,null,"","","","","","",""]
[222,"","","","","","",null,"","","","","","","",null,null,null,"","","","","","",""]
[223,"","","","","","",null,"","","","","","","",null,null,null,"","","","","","",""]
[224,"","","","","","",null,"","","","","","","",null,null,null,"","","","","","",""]
[225,"","","","","","",null,"","","","","","","",null,null,null,"","","","","","",""]
[226,"","","","","","",null,"","","","","","","",null,null,null,"","","","","","",""]
[227,"","","","","","",null,"","","","","","","",null,null,null,"","","","","","",""]
[228,"","","","","","",null,"","","","","","","",null,null,null,"","","","","","",""]
[229,"","","","","","",null,"","","","","","","",null,null,null,"","","","","","",""]
[230,"","","","","","",null,"","","","","","","",null,null,null,"","","","","","",""]
[231,"","","","","","",null,"","","","","","","",null,null,null,"","","","","","",""]
[232,"","","","","","",null,"","","","","","","",null,null,null,"","","","","","",""]
[233,"","","","","","",null,"","","","","","","",null,null,null,"","","","","","",""]
[234,"","","","","","",null,"","","","","","","",null,null,null,"","","","","","",""]
[235,"","","","","","",null,"","","","","","","",null,null,null,"","","","","","",""]
[236,"","","","","","",null,"","","","","","","",null,null,null,"","","","","","",""]
[237,"","","","","","",null,"","","","","","","",null,null,null,"","","","","","",""]
[238,"","","","","","",null,"","","","","","","",null,null,null,"","","","","","",""]
[239,"","","","","","",null,"","","","","","","",null,null,null,"","","","","","",""]
[240,"","","","","","",null,"","","","","","","",null,null,null,"","","","","","",""]
[241,"","","","","","",null,"","","","","","","",null,null,null,"","","","","","",""]
[242,"","","","","","",null,"","","","","","","",null,null,null,"","","","","","",""]
[243,"","","","","","",null,"","","","","","","",null,null,null,"","","","","","",""]
[244,"","","","","","",null,"","","","","","","",null,null,null,"","","","","","",""]
[245,"","","","","","",null,"","","","","","","",null,null,null,"","","","","","",""]
[246,"","","","","","",null,"","","","","","","",null,null,null,"","","","","","",""]
[247,"","","","","","",null,"","","","","","","",null,null,null,"","","","","","",""]
[248,"","","","","","",null,"","","","","","","",null,null,null,"","","","","","",""]
[249,"","","","","","",null,"","","","","","","",null,null,null,"","","","","","",""]
[250,"","","","","","",null,"","","","","","","",null,null,null,"","","","","","",""]
[251,"","","","","","",null,"","","","","","","",null,null,null,"","","","","","",""]
[252,"","","","","","",null,"","","","","","","",null,null,null,"","","","","","",""]
[253,"","","","","","",null,"","","","","","","",null,null,null,"","","","","","",""]
[254,"","","","","","",null,"","","","","","","",null,null,null,"","","","","","",""]
[255,"","","","","","",null,"","","","","","","",null,null,null,"","","","","","",""]
[256,"","","","","","",null,"","","","","","","",null,null,null,"","","","","","",""]
[257,"","","","","","",null,"","","","","","","",null,null,null,"","","","","","",""]
[258,"","","","","","",null,"","","","","","","",null,null,null,"","","","","","",""]
[259,"","","","","","",null,"","","","","","","",null,null,null,"","","","","","",""]
[260,"","","","","","",null,"","","","","","","",null,null,null,"","","","","","",""]
[261,"","","","","","",null,"","","","","","","",null,null,null,"","","","","","",""]
[262,"","","","","","",null,"","","","","","","",null,null,null,"","","","","","",""]
[263,"","","","","","",null,"","","","","","","",null,null,null,"","","","","","",""]
[264,"","","","","","",null,"","","","","","","",null,null,null,"","","","","","",""]
[265,"","","","","","",null,"","","","","","","",null,null,null,"","","","","","",""]
[266,"","","","","","",null,"","","","","","","",null,null,null,"","","","","","",""]
[267,"","","","","","",null,"","","","","","","",null,null,null,"","","","","","",""]
[268,"","","","","","",null,"","","","","","","",null,null,null,"","","","","","",""]
[269,"","","","","","",null,"","","","","","","",null,null,null,"","","","","","",""]
[270,"","","","","","",null,"","","","","","","",null,null,null,"","","","","","",""]
[271,"","","","","","",null,"","","","","","","",null,null,null,"","","","","","",""]
[272,"","","","","","",null,"","","","","","","",null,null,null,"","","","","","",""]
[273,"","","","","","",null,"","","","","","","",null,null,null,"","","","","","",""]
[274,"","","","","","",null,"","","","","","","",null,null,null,"","","","","","",""]
[275,"","","","","","",null,"","","","","","","",null,null,null,"","","","","","",""]
[276,"","","","","","",null,"","","","","","","",null,null,null,"","","","","","",""]
[277,"","","","","","",null,"","","","","","","",null,null,null,"","","","","","",""]
[278,"","","","","","",null,"","","","","","","",null,null,null,"","","","","","",""]
[279,"","","","","","",null,"","","","","","","",null,null,null,"","","","","","",""]
[280,"","","","","","",null,"","","","","","","",null,null,null,"","","","","","",""]
[null,null,null,null,null,null,null,null,null,null,null,null,null,null,null,null,null,null,"","","","","","",""]

{"sheet":"Macro BG","index":16,"n_rows":291,"n_cols":25,"rows_kept":291,"cut":false,"hidden":false,"merged":[[0,0,0,3]]}
["FONCTIONNEMENT DE LA MACRO"]
[1,"COLLER LES RESULTATS DANS LE TABLEAU DE GAUCHE"]
[2,"COPIER LA FORMULE",null,null,"=SI($D12=\"bg1\";D12;\"\")"]
[]
[3,"FAIRE  UN COPIER COLLER DES VALEURS AVEC UN COLLAGE SPECIALE \"VALEURS\""]
[4,"Faire un trie ZA pour BF1 et bf2"]
[5,"coller dans la feuille "]
[]
[]
[]
["PLACES","NOMS","PRENOMS","CATE","ETABLISSEMENT","VILLE","N°",null,"PLACES","NOMS","PRENOMS","CATE","ETABLISSEMENT","VILLE","N°",null,null,null,"PLACES","NOMS","PRENOMS","CATE","ETABLISSEMENT","VILLE","N°"]
[1,"IKUNGU BOMOLO","Imâan","BG2","DE PISAN","PERTHES",0,null,5,"LARSONNEUR","Justin","BG1","LA MARE AUX CHAMPS","VAUX",0,null,null,"",1,"IKUNGU BOMOLO","Imâan","BG2","DE PISAN","PERTHES",0]
[2,"GONTHIER","Kylian","BG2","DE PISAN","PERTHES",0,null,7,"PAWLIK","Benoit","BG1","J AMYOT","MELUN",0,null,null,"",2,"GONTHIER","Kylian","BG2","DE PISAN","PERTHES",0]
[3,"AISSANI","Yanis","BG2","DOISNEAU","DAMMARIE",0,null,11,"LAMARE","Nicolas","BG1","DE PISAN","PERTHES",0,null,null,"",3,"AISSANI","Yanis","BG2","DOISNEAU","DAMMARIE",0]
[4,"CHAUSSE","Adrian","BG2","J AMYOT","MELUN",0,null,13,"LUKOMBO","nathan","BG1","J D'ARC","MELUN",0,null,null,"",4,"CHAUSSE","Adrian","BG2","J AMYOT","MELUN",0]
[5,"LARSONNEUR","Justin","BG1","LA MARE AUX CHAMPS","VAUX",0,null,19,"DOUTRELON","jules","BG1","J D'ARC","MELUN",0,null,null,"",6,"LOPES","Yohann","BG2","BROSSOLETTE","MELUN",0]
[6,"LOPES","Yohann","BG2","BROSSOLETTE","MELUN",0,null,29,"FRIGUI","Ahmed","BG1","CHOPIN","MELUN",0,null,null,null,8,"BAGBEMA","Zoumana","BG2","BROSSOLETTE","MELUN",0]
[7,"PAWLIK","Benoit","BG1","J AMYOT","MELUN",0,null,30,"PESTAT","Tilouan","BG1","DE PISAN","PERTHES",0,null,null,null,9,"WANSTER","alexis","BG2","J D'ARC","MELUN",0]
[8,"BAGBEMA","Zoumana","BG2","BROSSOLETTE","MELUN",0,null,31,"KIBWATIAKA","Kilian","BG1","LA MARE AUX CHAMPS","VAUX",0,null,null,null,10,"MEBTOUL","Samir","BG2","CHOPIN","MELUN",0]
[9,"WANSTER","alexis","BG2","J D'ARC","MELUN",0,null,33,"BELLO","Romain","BG1","CH PEGUY","VERNEUIL",0,null,null,null,12,"TEKA MAYALU","Ryan","BG2","CHOPIN","MELUN",0]
[10,"MEBTOUL","Samir","BG2","CHOPIN","MELUN",0,null,36,"PRADO","martin","BG1","J D'ARC","MELUN",0,null,null,null,14,"COLONNA","Adrien Dorius","BG2","DE PISAN","PERTHES",0]
[11,"LAMARE","Nicolas","BG1","DE PISAN","PERTHES",0,null,37,"SURENA","Louis","BG1","NAZARETH","VOISENON",0,null,null,null,15,"SYLVAIN","Julien","BG2","DE PISAN","PERTHES",0]
[12,"TEKA MAYALU","Ryan","BG2","CHOPIN","MELUN",0,null,43,"KIYINDO","Yvan","BG1","BROSSOLETTE","MELUN",0,null,null,null,16,"MUNTU WA MUNGU","Vimoj","BG2","CAPUCINS","MELUN",0]
[13,"LUKOMBO","nathan","BG1","J D'ARC","MELUN",0,null,45,"AIT EL MAALEM","Yliass","BG1","DOISNEAU","DAMMARIE",0,null,null,null,17,"INCANDELA","Baptiste","BG2","DE PISAN","PERTHES",0]
[14,"COLONNA","Adrien Dorius","BG2","DE PISAN","PERTHES",0,null,48,"DUCROTOY","Tristan","BG1","ELSA TRIOLET","LE MEE",0,null,null,null,18,"BAVOL","Joan","BG2","LA MARE AUX CHAMPS","VAUX",0]
[15,"SYLVAIN","Julien","BG2","DE PISAN","PERTHES",0,null,49,"KOUKABA","Yanis","BG1","BROSSOLETTE","MELUN",0,null,null,null,20,"KUNZALA","Benjamin","BG2","F VILLON","PONTHIERRY",0]
[16,"MUNTU WA MUNGU","Vimoj","BG2","CAPUCINS","MELUN",0,null,50,"NSEKE","Gaël","BG1","BROSSOLETTE","MELUN",0,null,null,null,21,"MOHAMED","Akim","BG2","BROSSOLETTE","MELUN",0]
[17,"INCANDELA","Baptiste","BG2","DE PISAN","PERTHES",0,null,53,"ARSLAN","Orkun","BG1","CAPUCINS","MELUN",0,null,null,null,22,"SANSON","Malo","BG2","LA MARE AUX CHAMPS","VAUX",0]
[18,"BAVOL","Joan","BG2","LA MARE AUX CHAMPS","VAUX",0,null,54,"TEMIROV","Malik","BG1","BROSSOLETTE","MELUN",0,null,null,"",23,"DIPEIN","Calvin","BG2","BROSSOLETTE","MELUN",0]
[19,"DOUTRELON","jules","BG1","J D'ARC","MELUN",0,null,55,"LEMAIRE","Enzo","BG1","CH PEGUY","VERNEUIL",0,null,null,"",24,"CABEZAS EGEA","Amaury","BG2","DE PISAN","PERTHES",0]
[20,"KUNZALA","Benjamin","BG2","F VILLON","PONTHIERRY",0,null,56,"DE SOUSA BORGES","Nathan","BG1","CH PEGUY","VERNEUIL",0,null,null,"",25,"OBRIOT","Enzo","BG2","CH PEGUY","VERNEUIL",0]
[21,"MOHAMED","Akim","BG2","BROSSOLETTE","MELUN",0,null,57,"HIMMER","Sherydan","BG1","ELSA TRIOLET","LE MEE",0,null,null,null,26,"MIALET","Antoine","BG2","DE PISAN","PERTHES",0]
[22,"SANSON","Malo","BG2","LA MARE AUX CHAMPS","VAUX",0,null,59,"BENKAIDA ","yanis","BG1","J D'ARC","MELUN",0,null,null,"",27,"BENALI","Riad-Mohamed","BG2","CHOPIN","MELUN",0]
[23,"DIPEIN","Calvin","BG2","BROSSOLETTE","MELUN",0,null,60,"BAGUIDY","samuel","BG1","J D'ARC","MELUN",0,null,null,"",28,"CANTAREL","Emilio","BG2","CH PEGUY","VERNEUIL",0]
[24,"CABEZAS EGEA","Amaury","BG2","DE PISAN","PERTHES",0,null,61,"GIRARD","Maxime","BG1","DE PISAN","PERTHES","",null,null,"",32,"ISMAEL","Belaid","BG2","ELSA TRIOLET","LE MEE",0]
[25,"OBRIOT","Enzo","BG2","CH PEGUY","VERNEUIL",0,null,63,"PAWLIK","Clément","BG1","DOISNEAU","DAMMARIE",0,null,null,"",34,"HAMMANI","Ilyess","BG2","BROSSOLETTE","MELUN",0]
[26,"MIALET","Antoine","BG2","DE PISAN","PERTHES",0,null,64,"BILLIET","Baptiste","BG1","NAZARETH","VOISENON",0,null,null,"",35,"BRICOUT","Amélien","BG2","LA MARE AUX CHAMPS","VAUX",0]
[27,"BENALI","Riad-Mohamed","BG2","CHOPIN","MELUN",0,null,65,"VIGNEAU","Erwan","BG1","R BONHEUR","LE CHATELET",0,null,null,"",38,"DOS SANTOS","Raphaël","BG2","ELSA TRIOLET","LE MEE",0]
[28,"CANTAREL","Emilio","BG2","CH PEGUY","VERNEUIL",0,null,66,"BRULE","Titouan","BG1","NAZARETH","VOISENON",0,null,"","",39,"HANDALA","Adam","BG2","ELSA TRIOLET","LE MEE",0]
[29,"FRIGUI","Ahmed","BG1","CHOPIN","MELUN",0,null,67,"DELALANDE","Gabriel","BG1","CH PEGUY","VERNEUIL",0,null,null,"",40,"BRUIANT","Antonin","BG2","F VILLON","PONTHIERRY",0]
[30,"PESTAT","Tilouan","BG1","DE PISAN","PERTHES",0,null,68,"EL-KRID","Issam","BG1","CH PEGUY","VERNEUIL",0,null,null,"",41,"BOMBAY KOY","Jason","BG2","R BONHEUR","LE CHATELET",0]
[31,"KIBWATIAKA","Kilian","BG1","LA MARE AUX CHAMPS","VAUX",0,null,69,"MONGE","Xavier","BG1","CH PEGUY","VERNEUIL",0,null,null,"",42,"VEILLARD","Quentin","BG2","F VILLON","PONTHIERRY",0]
[32,"ISMAEL","Belaid","BG2","ELSA TRIOLET","LE MEE",0,null,70,"LOUGBEGNON","Marvin","BG1","ELSA TRIOLET","LE MEE",0,null,null,null,44,"GAULARD","Clément","BG2","CH PEGUY","VERNEUIL",0]
[33,"BELLO","Romain","BG1","CH PEGUY","VERNEUIL",0,null,72,"NOKO LAND","Horlan","BG1","BROSSOLETTE","MELUN",0,null,null,null,47,"LIMA SANCAO","Schilo","BG2","CAPUCINS","MELUN",0]
[34,"HAMMANI","Ilyess","BG2","BROSSOLETTE","MELUN",0,null,74,"MILLOT","Lancelot","BG1","DE PISAN","PERTHES",0,null,null,"",51,"MOHAMED","Akim","BG2","BROSSOLETTE","MELUN",0]
[35,"BRICOUT","Amélien","BG2","LA MARE AUX CHAMPS","VAUX",0,null,75,"PACCHIANA ","Louis","BG1","R BONHEUR","LE CHATELET",0,null,null,"",52,"CAKAN","Adar","BG2","CHOPIN","MELUN",0]
[36,"PRADO","martin","BG1","J D'ARC","MELUN",0,null,76,"PALUMBO","alexandre","BG1","J D'ARC","MELUN",0,null,null,"",58,"SIMON","Titouan","BG2","CH PEGUY","VERNEUIL",0]
[37,"SURENA","Louis","BG1","NAZARETH","VOISENON",0,null,77,"GABRIEL","Allan","BG1","R BONHEUR","LE CHATELET",0,null,null,"",62,"DUSSUEL","Bastien","BG2","CH PEGUY","VERNEUIL",0]
[38,"DOS SANTOS","Raphaël","BG2","ELSA TRIOLET","LE MEE",0,null,78,"BENALI","ylies","BG1","J D'ARC","MELUN",0,null,null,"",71,"PEREGUDOV","Steven","BG2","ELSA TRIOLET","LE MEE",0]
[39,"HANDALA","Adam","BG2","ELSA TRIOLET","LE MEE",0,null,83,"DORE","JASON","BG1","R BONHEUR","LE CHATELET",0,null,null,"",73,"REYMOND","alexandre","BG2","J D'ARC","MELUN",0]
[40,"BRUIANT","Antonin","BG2","F VILLON","PONTHIERRY",0,null,85,"THAMI","Manoa","BG1","CH PEGUY","VERNEUIL",0,null,null,"",79,"CHAMDRYKOWSKA","Arthur","BG2","LA MARE AUX CHAMPS","VAUX",0]
[41,"BOMBAY KOY","Jason","BG2","R BONHEUR","LE CHATELET",0,null,87,"DRICI","MOUNIR","BG1","J AMYOT","MELUN",0,null,null,"",80,"DELCROIX","Enzo","BG2","LA MARE AUX CHAMPS","VAUX",0]
[42,"VEILLARD","Quentin","BG2","F VILLON","PONTHIERRY",0,null,88,"ARSLAN","Orkun","BG1","CAPUCINS","MELUN",0,null,null,"",81,"BOISARD","Nicolas","BG2","CH PEGUY","VERNEUIL",0]
[43,"KIYINDO","Yvan","BG1","BROSSOLETTE","MELUN",0,null,89,"IVANCIU","Florin","BG1","ELSA TRIOLET","LE MEE",0,null,null,"",82,"ASCOFARE","Djibril","BG2","BROSSOLETTE","MELUN",0]
[44,"GAULARD","Clément","BG2","CH PEGUY","VERNEUIL",0,null,90,"SOUGMI","Badre","BG1","BROSSOLETTE","MELUN",0,null,null,"",84,"JOYEZ","Robin","BG2","CH PEGUY","VERNEUIL",0]
[45,"AIT EL MAALEM","Yliass","BG1","DOISNEAU","DAMMARIE",0,null,91,"RICOU","Mattéo","BG1","DOISNEAU","DAMMARIE",0,null,null,"",86,"SIDIBE","Mamadou","BG2","BROSSOLETTE","MELUN",0]
[46,"SOULEIMANOV","Akraman","MG","CAPUCINS","MELUN",0,null,92,"BAILAY","Eliott","BG1","DE PISAN","PERTHES",0,null,null,"",93,"SIMONOT","Yann","BG2","LA MARE AUX CHAMPS","VAUX",0]
[47,"LIMA SANCAO","Schilo","BG2","CAPUCINS","MELUN",0,null,94,"BOLMIER","Mattéo","BG1","DE PISAN","PERTHES",0,null,null,"",96,"AMBATE","Chris","BG2","R BONHEUR","LE CHATELET",0]
[48,"DUCROTOY","Tristan","BG1","ELSA TRIOLET","LE MEE",0,null,95,"HAMMATI","Rayyane","BG1","CH PEGUY","VERNEUIL",0,null,null,"",98,"DUVERGT","Rémy","BG2","R BONHEUR","LE CHATELET",0]
[49,"KOUKABA","Yanis","BG1","BROSSOLETTE","MELUN",0,null,97,"CHAILLOT","paul","BG1","J D'ARC","MELUN",0,null,null,"",99,"MUNTU WA MUNGU","Vimoj","BG2","CAPUCINS","MELUN",0]
[50,"NSEKE","Gaël","BG1","BROSSOLETTE","MELUN",0,null,100,"LOLKI PAYENGI","Lemaiyan","BG1","DOISNEAU","DAMMARIE",0,null,null,"",110,"DESPREZ","Adrien","BG2","CH PEGUY","VERNEUIL",0]
[51,"MOHAMED","Akim","BG2","BROSSOLETTE","MELUN",0,null,101,"JATTEAU","Simon","BG1","LA MARE AUX CHAMPS","VAUX",0,null,null,"",111,"LAUNAY","Mathéo","BG2","CH PEGUY","VERNEUIL",0]
[52,"CAKAN","Adar","BG2","CHOPIN","MELUN",0,null,102,"GILLET","Malvin","BG1","DE PISAN","PERTHES",0,null,null,"",117,"BOULERY","Ethan","BG2","CAPUCINS","MELUN",0]
[53,"ARSLAN","Orkun","BG1","CAPUCINS","MELUN",0,null,103,"GARAUD-RAKOTONIAINA","Enzo","BG1","ELSA TRIOLET","LE MEE",0,null,null,"",118,"HURTEAU","MAXIME","BG2","R BONHEUR","LE CHATELET",0]
[54,"TEMIROV","Malik","BG1","BROSSOLETTE","MELUN",0,null,104,"BOUEDO","Florian","BG1","NAZARETH","VOISENON",0,null,null,"",121,"KHERBACHE","Bilal","BG2","CAPUCINS","MELUN",0]
[55,"LEMAIRE","Enzo","BG1","CH PEGUY","VERNEUIL",0,null,105,"BOURGEOIS","Mathis","BG1","DE PISAN","PERTHES",0,null,null,"",127,"GALOPULO","Adam","BG2","LA MARE AUX CHAMPS","VAUX",0]
[56,"DE SOUSA BORGES","Nathan","BG1","CH PEGUY","VERNEUIL",0,null,106,"TUTU MAYANGILA","Ryan","BG1","CAPUCINS","MELUN",0,null,null,"",131,"YESILBAS ","Yousoufcan","BG2","CHOPIN","MELUN",0]
[57,"HIMMER","Sherydan","BG1","ELSA TRIOLET","LE MEE",0,null,107,"AISSAOUI","Marwane","BG1","J AMYOT","MELUN",0,null,null,"",134,"LUMBNSUNGU ","Eden","BG2","CHOPIN","MELUN",0]
[58,"SIMON","Titouan","BG2","CH PEGUY","VERNEUIL",0,null,108,"MARTINEZ","Téo","BG1","CH PEGUY","VERNEUIL",0,null,null,"",135,"VERRES ","Clément","BG2","CHOPIN","MELUN",0]
[59,"BENKAIDA ","yanis","BG1","J D'ARC","MELUN",0,null,109,"SAMBAKE ","Bandiougou","BG1","CHOPIN","MELUN",0,null,null,"",143,"OUKASSOU ","Mohamed","BG2","CHOPIN","MELUN",0]
[60,"BAGUIDY","samuel","BG1","J D'ARC","MELUN",0,null,112,"JOLY","Maxime","BG1","DE PISAN","PERTHES",0,null,null,"",150,"BENDJEBBOUR","Zakaria","BG2","CHOPIN","MELUN",0]
[61,"GIRARD","Maxime","BG1","DE PISAN","PERTHES","",null,113,"HAMDI","Yassine","BG1","BROSSOLETTE","MELUN",0,null,null,"",158,"KHAPIZOV ","Djabrail","BG2","CHOPIN","MELUN",0]
[62,"DUSSUEL","Bastien","BG2","CH PEGUY","VERNEUIL",0,null,114,"LOPES BORGES","Killian","BG1","BROSSOLETTE","MELUN",0,null,null,"",159,"DURRWEL ","Rudy","BG2","CHOPIN","MELUN",0]
[63,"PAWLIK","Clément","BG1","DOISNEAU","DAMMARIE",0,null,115,"EL-KRID","Issam","BG1","CH PEGUY","VERNEUIL",0,null,null,"",162,"LUCEA ","Menjy","BG2","CHOPIN","MELUN",0]
[64,"BILLIET","Baptiste","BG1","NAZARETH","VOISENON",0,null,116,"KERNANET","victor","BG1","J D'ARC","MELUN",0,null,null,"","","","","","","",""]
[65,"VIGNEAU","Erwan","BG1","R BONHEUR","LE CHATELET",0,null,119,"GUILBERT","Thibault","BG1","DOISNEAU","DAMMARIE",0,null,null,"","","","","","","",""]
[66,"BRULE","Titouan","BG1","NAZARETH","VOISENON",0,null,120,"LEBOUAZOLA","Yanis","BG1","NAZARETH","VOISENON",0,null,null,"","","","","","","",""]
[67,"DELALANDE","Gabriel","BG1","CH PEGUY","VERNEUIL",0,null,122,"HOCINE ","Yassine","BG1","CHOPIN","MELUN",0,null,null,"","","","","","","",""]
[68,"EL-KRID","Issam","BG1","CH PEGUY","VERNEUIL",0,null,123,"LELO","François","BG1","CAPUCINS","MELUN",0,null,null,"","","","","","","",""]
[69,"MONGE","Xavier","BG1","CH PEGUY","VERNEUIL",0,null,124,"LELO","François","BG1","CAPUCINS","MELUN",0,null,null,"","","","","","","",""]
[70,"LOUGBEGNON","Marvin","BG1","ELSA TRIOLET","LE MEE",0,null,125,"GALLET","Bastien","BG1","DOISNEAU","DAMMARIE",0,null,null,"","","","","","","",""]
[71,"PEREGUDOV","Steven","BG2","ELSA TRIOLET","LE MEE",0,null,126,"PELLARD","Alexandre","BG1","CH PEGUY","VERNEUIL",0,null,null,null,"","","","","","",""]
[72,"NOKO LAND","Horlan","BG1","BROSSOLETTE","MELUN",0,null,128,"MOITIE","Lysandre","BG1","DE PISAN","PERTHES",0,null,null,null,"","","","","","",""]
[73,"REYMOND","alexandre","BG2","J D'ARC","MELUN",0,null,129,"BERGER","Gregory","BG1","CH PEGUY","VERNEUIL",0,null,null,null,"","","","","","",""]
[74,"MILLOT","Lancelot","BG1","DE PISAN","PERTHES",0,null,130,"VILLENEUVE","Alexis","BG1","CH PEGUY","VERNEUIL",0,null,null,null,"","","","","","",""]
[75,"PACCHIANA ","Louis","BG1","R BONHEUR","LE CHATELET",0,null,132,"MOITIE","Aléxis","BG1","LA MARE AUX CHAMPS","VAUX",0,null,null,null,"","","","","","",""]
[76,"PALUMBO","alexandre","BG1","J D'ARC","MELUN",0,null,133,"N'SONGO","Yoan","BG1","ELSA TRIOLET","LE MEE",0,null,null,null,"","","","","","",""]
[77,"GABRIEL","Allan","BG1","R BONHEUR","LE CHATELET",0,null,136,"AHMED","Antoine","BG1","CAPUCINS","MELUN",0,null,null,null,"","","","","","",""]
[78,"BENALI","ylies","BG1","J D'ARC","MELUN",0,null,137,"PAROLARI","Quentin","BG1","NAZARETH","VOISENON",0,null,null,null,"","","","","","",""]
[79,"CHAMDRYKOWSKA","Arthur","BG2","LA MARE AUX CHAMPS","VAUX",0,null,138,"DO NASCIMENTO","Pablo","BG1","NAZARETH","VOISENON",0,null,null,null,"","","","","","",""]
[80,"DELCROIX","Enzo","BG2","LA MARE AUX CHAMPS","VAUX",0,null,139,"BENCHABANE","Ilyess","BG1","CHOPIN","MELUN",0,null,null,null,"","","","","","",""]
[81,"BOISARD","Nicolas","BG2","CH PEGUY","VERNEUIL",0,null,140,"COQUELIN","Jeremy","BG1","CH PEGUY","VERNEUIL",0,null,null,"","","","","","","",""]
[82,"ASCOFARE","Djibril","BG2","BROSSOLETTE","MELUN",0,null,141,"POUGET","Quentin","BG1","ELSA TRIOLET","LE MEE",0,null,null,"","","","","","","",""]
[83,"DORE","JASON","BG1","R BONHEUR","LE CHATELET",0,null,142,"KATHIRAVELU","Hajeen","BG1","ELSA TRIOLET","LE MEE",0,null,null,"","","","","","","",""]
[84,"JOYEZ","Robin","BG2","CH PEGUY","VERNEUIL",0,null,144,"LETORT","clément","BG1","J D'ARC","MELUN",0,null,null,"","","","","","","",""]
[85,"THAMI","Manoa","BG1","CH PEGUY","VERNEUIL",0,null,145,"BRIDJA","Abed","BG1","J AMYOT","MELUN",0,null,null,"","","","","","","",""]
[86,"SIDIBE","Mamadou","BG2","BROSSOLETTE","MELUN",0,null,146,"KADDOURI","Wassim","BG1","NAZARETH","VOISENON",0,null,null,"","","","","","","",""]
[87,"DRICI","MOUNIR","BG1","J AMYOT","MELUN",0,null,147,"CORNANO","Mathias","BG1","CH PEGUY","VERNEUIL",0,null,null,"","","","","","","",""]
[88,"ARSLAN","Orkun","BG1","CAPUCINS","MELUN",0,null,148,"POREE","kyllian","BG1","J D'ARC","MELUN",0,null,null,null,"","","","","","",""]
[89,"IVANCIU","Florin","BG1","ELSA TRIOLET","LE MEE",0,null,149,"DELMAS","baptiste","BG1","J D'ARC","MELUN",0,null,null,null,"","","","","","",""]
[90,"SOUGMI","Badre","BG1","BROSSOLETTE","MELUN",0,null,151,"AITSALIH \n\n","Younes","BG1","CHOPIN","MELUN",0,null,null,null,"","","","","","",""]
[91,"RICOU","Mattéo","BG1","DOISNEAU","DAMMARIE",0,null,152,"BOURDIN","Tony","BG1","LA FONTAINE","LE MEE",0,null,null,null,"","","","","","",""]
[92,"BAILAY","Eliott","BG1","DE PISAN","PERTHES",0,null,153,"KACIMI ","Faresse","BG1","CHOPIN","MELUN",0,null,null,"","","","","","","",""]
[93,"SIMONOT","Yann","BG2","LA MARE AUX CHAMPS","VAUX",0,null,154,"GUILLEMIN","Quentin","BG1","LA FONTAINE","LE MEE",0,null,null,"","","","","","","",""]
[94,"BOLMIER","Mattéo","BG1","DE PISAN","PERTHES",0,null,155,"BENDJEBOUR ","Mehdi","BG1","CHOPIN","MELUN",0,null,null,"","","","","","","",""]
[95,"HAMMATI","Rayyane","BG1","CH PEGUY","VERNEUIL",0,null,156,"MIDEY ","Théo","BG1","CHOPIN","MELUN",0,null,null,"","","","","","","",""]
[96,"AMBATE","Chris","BG2","R BONHEUR","LE CHATELET",0,null,157,"TRINH","tristan","BG1","J D'ARC","MELUN",0,null,null,"","","","","","","",""]
[97,"CHAILLOT","paul","BG1","J D'ARC","MELUN",0,null,160,"MNIA ","Firdaws","BG1","CHOPIN","MELUN",0,null,null,"","","","","","","",""]
[98,"DUVERGT","Rémy","BG2","R BONHEUR","LE CHATELET",0,null,161,"DUCHAMPS","romain","BG1","J D'ARC","MELUN",0,null,null,"","","","","","","",""]
[99,"MUNTU WA MUNGU","Vimoj","BG2","CAPUCINS","MELUN",0,null,"","","","","","","",null,null,"","","","","","","",""]
[100,"LOLKI PAYENGI","Lemaiyan","BG1","DOISNEAU","DAMMARIE",0,null,"","","","","","","",null,null,"","","","","","","",""]
[101,"JATTEAU","Simon","BG1","LA MARE AUX CHAMPS","VAUX",0,null,"","","","","","","",null,null,null,"","","","","","",""]
[102,"GILLET","Malvin","BG1","DE PISAN","PERTHES",0,null,"","","","","","","",null,null,"","","","","","","",""]
[103,"GARAUD-RAKOTONIAINA","Enzo","BG1","ELSA TRIOLET","LE MEE",0,null,"","","","","","","",null,null,"","","","","","","",""]
[104,"BOUEDO","Florian","BG1","NAZARETH","VOISENON",0,null,"","","","","","","",null,null,"","","","","","","",""]
[105,"BOURGEOIS","Mathis","BG1","DE PISAN","PERTHES",0,null,"","","","","","","",null,null,"","","","","","","",""]
[106,"TUTU MAYANGILA","Ryan","BG1","CAPUCINS","MELUN",0,null,"","","","","","","",null,null,"","","","","","","",""]
[107,"AISSAOUI","Marwane","BG1","J AMYOT","MELUN",0,null,"","","","","","","",null,null,"","","","","","","",""]
[108,"MARTINEZ","Téo","BG1","CH PEGUY","VERNEUIL",0,null,"","","","","","","",null,null,"","","","","","","",""]
[109,"SAMBAKE ","Bandiougou","BG1","CHOPIN","MELUN",0,null,"","","","","","","",null,null,"","","","","","","",""]
[110,"DESPREZ","Adrien","BG2","CH PEGUY","VERNEUIL",0,null,"","","","","","","",null,null,"","","","","","","",""]
[111,"LAUNAY","Mathéo","BG2","CH PEGUY","VERNEUIL",0,null,"","","","","","","",null,null,"","","","","","","",""]
[112,"JOLY","Maxime","BG1","DE PISAN","PERTHES",0,null,"","","","","","","",null,null,"","","","","","","",""]
[113,"HAMDI","Yassine","BG1","BROSSOLETTE","MELUN",0,null,"","","","","","","",null,null,"","","","","","","",""]
[114,"LOPES BORGES","Killian","BG1","BROSSOLETTE","MELUN",0,null,"","","","","","","",null,null,"","","","","","","",""]
[115,"EL-KRID","Issam","BG1","CH PEGUY","VERNEUIL",0,null,"","","","","","","",null,null,"","","","","","","",""]
[116,"KERNANET","victor","BG1","J D'ARC","MELUN",0,null,"","","","","","","",null,null,"","","","","","","",""]
[117,"BOULERY","Ethan","BG2","CAPUCINS","MELUN",0,null,"","","","","","","",null,null,"","","","","","","",""]
[118,"HURTEAU","MAXIME","BG2","R BONHEUR","LE CHATELET",0,null,"","","","","","","",null,null,"","","","","","","",""]
[119,"GUILBERT","Thibault","BG1","DOISNEAU","DAMMARIE",0,null,"","","","","","","",null,null,"","","","","","","",""]
[120,"LEBOUAZOLA","Yanis","BG1","NAZARETH","VOISENON",0,null,"","","","","","","",null,null,"","","","","","","",""]
[121,"KHERBACHE","Bilal","BG2","CAPUCINS","MELUN",0,null,"","","","","","","",null,null,"","","","","","","",""]
[122,"HOCINE ","Yassine","BG1","CHOPIN","MELUN",0,null,"","","","","","","",null,null,"","","","","","","",""]
[123,"LELO","François","BG1","CAPUCINS","MELUN",0,null,"","","","","","","",null,null,"","","","","","","",""]
[124,"LELO","François","BG1","CAPUCINS","MELUN",0,null,"","","","","","","",null,null,"","","","","","","",""]
[125,"GALLET","Bastien","BG1","DOISNEAU","DAMMARIE",0,null,"","","","","","","",null,null,"","","","","","","",""]
[126,"PELLARD","Alexandre","BG1","CH PEGUY","VERNEUIL",0,null,"","","","","","","",null,null,"","","","","","","",""]
[127,"GALOPULO","Adam","BG2","LA MARE AUX CHAMPS","VAUX",0,null,"","","","","","","",null,null,"","","","","","","",""]
[128,"MOITIE","Lysandre","BG1","DE PISAN","PERTHES",0,null,"","","","","","","",null,null,"","","","","","","",""]
[129,"BERGER","Gregory","BG1","CH PEGUY","VERNEUIL",0,null,"","","","","","","",null,null,"","","","","","","",""]
[130,"VILLENEUVE","Alexis","BG1","CH PEGUY","VERNEUIL",0,null,"","","","","","","",null,null,"","","","","","","",""]
[131,"YESILBAS ","Yousoufcan","BG2","CHOPIN","MELUN",0,null,"","","","","","","",null,null,null,"","","","","","",""]
[132,"MOITIE","Aléxis","BG1","LA MARE AUX CHAMPS","VAUX",0,null,"","","","","","","",null,null,null,"","","","","","",""]
[133,"N'SONGO","Yoan","BG1","ELSA TRIOLET","LE MEE",0,null,"","","","","","","",null,null,null,"","","","","","",""]
[134,"LUMBNSUNGU ","Eden","BG2","CHOPIN","MELUN",0,null,"","","","","","","",null,null,null,"","","","","","",""]
[135,"VERRES ","Clément","BG2","CHOPIN","MELUN",0,null,"","","","","","","",null,null,null,"","","","","","",""]
[136,"AHMED","Antoine","BG1","CAPUCINS","MELUN",0,null,"","","","","","","",null,null,null,"","","","","","",""]
[137,"PAROLARI","Quentin","BG1","NAZARETH","VOISENON",0,null,"","","","","","","",null,null,null,"","","","","","",""]
[138,"DO NASCIMENTO","Pablo","BG1","NAZARETH","VOISENON",0,null,"","","","","","","",null,null,null,"","","","","","",""]
[139,"BENCHABANE","Ilyess","BG1","CHOPIN","MELUN",0,null,"","","","","","","",null,null,null,"","","","","","",""]
[140,"COQUELIN","Jeremy","BG1","CH PEGUY","VERNEUIL",0,null,"","","","","","","",null,null,null,"","","","","","",""]
[141,"POUGET","Quentin","BG1","ELSA TRIOLET","LE MEE",0,null,"","","","","","","",null,null,null,"","","","","","",""]
[142,"KATHIRAVELU","Hajeen","BG1","ELSA TRIOLET","LE MEE",0,null,"","","","","","","",null,null,null,"","","","","","",""]
[143,"OUKASSOU ","Mohamed","BG2","CHOPIN","MELUN",0,null,"","","","","","","",null,null,null,"","","","","","",""]
[144,"LETORT","clément","BG1","J D'ARC","MELUN",0,null,"","","","","","","",null,null,null,"","","","","","",""]
[145,"BRIDJA","Abed","BG1","J AMYOT","MELUN",0,null,"","","","","","","",null,null,null,"","","","","","",""]
[146,"KADDOURI","Wassim","BG1","NAZARETH","VOISENON",0,null,"","","","","","","",null,null,null,"","","","","","",""]
[147,"CORNANO","Mathias","BG1","CH PEGUY","VERNEUIL",0,null,"","","","","","","",null,null,null,"","","","","","",""]
[148,"POREE","kyllian","BG1","J D'ARC","MELUN",0,null,"","","","","","","",null,null,null,"","","","","","",""]
[149,"DELMAS","baptiste","BG1","J D'ARC","MELUN",0,null,"","","","","","","",null,null,null,"","","","","","",""]
[150,"BENDJEBBOUR","Zakaria","BG2","CHOPIN","MELUN",0,null,"","","","","","","",null,null,null,"","","","","","",""]
[151,"AITSALIH \n\n","Younes","BG1","CHOPIN","MELUN",0,null,"","","","","","","",null,null,null,"","","","","","",""]
[152,"BOURDIN","Tony","BG1","LA FONTAINE","LE MEE",0,null,"","","","","","","",null,null,null,"","","","","","",""]
[153,"KACIMI ","Faresse","BG1","CHOPIN","MELUN",0,null,"","","","","","","",null,null,null,"","","","","","",""]
[154,"GUILLEMIN","Quentin","BG1","LA FONTAINE","LE MEE",0,null,"","","","","","","",null,null,null,"","","","","","",""]
[155,"BENDJEBOUR ","Mehdi","BG1","CHOPIN","MELUN",0,null,"","","","","","","",null,null,null,"","","","","","",""]
[156,"MIDEY ","Théo","BG1","CHOPIN","MELUN",0,null,"","","","","","","",null,null,null,"","","","","","",""]
[157,"TRINH","tristan","BG1","J D'ARC","MELUN",0,null,"","","","","","","",null,null,null,"","","","","","",""]
[158,"KHAPIZOV ","Djabrail","BG2","CHOPIN","MELUN",0,null,"","","","","","","",null,null,null,"","","","","","",""]
[159,"DURRWEL ","Rudy","BG2","CHOPIN","MELUN",0,null,"","","","","","","",null,null,null,"","","","","","",""]
[160,"MNIA ","Firdaws","BG1","CHOPIN","MELUN",0,null,"","","","","","","",null,null,null,"","","","","","",""]
[161,"DUCHAMPS","romain","BG1","J D'ARC","MELUN",0,null,"","","","","","","",null,null,null,"","","","","","",""]
[162,"LUCEA ","Menjy","BG2","CHOPIN","MELUN",0,null,"","","","","","","",null,null,null,"","","","","","",""]
[163,"","","","","","",null,"","","","","","","",null,null,null,"","","","","","",""]
[164,"","","","","","",null,"","","","","","","",null,null,null,"","","","","","",""]
[165,"","","","","","",null,"","","","","","","",null,null,null,"","","","","","",""]
[166,"","","","","","",null,"","","","","","","",null,null,null,"","","","","","",""]
[167,"","","","","","",null,"","","","","","","",null,null,null,"","","","","","",""]
[168,"","","","","","",null,"","","","","","","",null,null,null,"","","","","","",""]
[169,"","","","","","",null,"","","","","","","",null,null,null,"","","","","","",""]
[170,"","","","","","",null,"","","","","","","",null,null,null,"","","","","","",""]
[171,"","","","","","",null,"","","","","","","",null,null,null,"","","","","","",""]
[172,"","","","","","",null,"","","","","","","",null,null,null,"","","","","","",""]
[173,"","","","","","",null,"","","","","","","",null,null,null,"","","","","","",""]
[174,"","","","","","",null,"","","","","","","",null,null,null,"","","","","","",""]
[175,"","","","","","",null,"","","","","","","",null,null,null,"","","","","","",""]
[176,"","","","","","",null,"","","","","","","",null,null,null,"","","","","","",""]
[177,"","","","","","",null,"","","","","","","",null,null,null,"","","","","","",""]
[178,"","","","","","",null,"","","","","","","",null,null,null,"","","","","","",""]
[179,"","","","","","",null,"","","","","","","",null,null,null,"","","","","","",""]
[180,"","","","","","",null,"","","","","","","",null,null,null,"","","","","","",""]
[181,"","","","","","",null,"","","","","","","",null,null,null,"","","","","","",""]
[182,"","","","","","",null,"","","","","","","",null,null,null,"","","","","","",""]
[183,"","","","","","",null,"","","","","","","",null,null,null,"","","","","","",""]
[184,"","","","","","",null,"","","","","","","",null,null,null,"","","","","","",""]
[185,"","","","","","",null,"","","","","","","",null,null,null,"","","","","","",""]
[186,"","","","","","",null,"","","","","","","",null,null,null,"","","","","","",""]
[187,"","","","","","",null,"","","","","","","",null,null,null,"","","","","","",""]
[188,"","","","","","",null,"","","","","","","",null,null,null,"","","","","","",""]
[189,"","","","","","",null,"","","","","","","",null,null,null,"","","","","","",""]
[190,"","","","","","",null,"","","","","","","",null,null,null,"","","","","","",""]
[191,"","","","","","",null,"","","","","","","",null,null,null,"","","","","","",""]
[192,"","","","","","",null,"","","","","","","",null,null,null,"","","","","","",""]
[193,"","","","","","",null,"","","","","","","",null,null,null,"","","","","","",""]
[194,"","","","","","",null,"","","","","","","",null,null,null,"","","","","","",""]
[195,"","","","","","",null,"","","","","","","",null,null,null,"","","","","","",""]
[196,"","","","","","",null,"","","","","","","",null,null,null,"","","","","","",""]
[197,"","","","","","",null,"","","","","","","",null,null,null,"","","","","","",""]
[198,"","","","","","",null,"","","","","","","",null,null,null,"","","","","","",""]
[199,"","","","","","",null,"","","","","","","",null,null,null,"","","","","","",""]
[200,"","","","","","",null,"","","","","","","",null,null,null,"","","","","","",""]
[201,"","","","","","",null,"","","","","","","",null,null,null,"","","","","","",""]
[202,"","","","","","",null,"","","","","","","",null,null,null,"","","","","","",""]
[203,"","","","","","",null,"","","","","","","",null,null,null,"","","","","","",""]
[204,"","","","","","",null,"","","","","","","",null,null,null,"","","","","","",""]
[205,"","","","","","",null,"","","","","","","",null,null,null,"","","","","","",""]
[206,"","","","","","",null,"","","","","","","",null,null,null,"","","","","","",""]
[207,"","","","","","",null,"","","","","","","",null,null,null,"","","","","","",""]
[208,"","","","","","",null,"","","","","","","",null,null,null,"","","","","","",""]
[209,"","","","","","",null,"","","","","","","",null,null,null,"","","","","","",""]
[210,"","","","","","",null,"","","","","","","",null,null,null,"","","","","","",""]
[211,"","","","","","",null,"","","","","","","",null,null,null,"","","","","","",""]
[212,"","","","","","",null,"","","","","","","",null,null,null,"","","","","","",""]
[213,"","","","","","",null,"","","","","","","",null,null,null,"","","","","","",""]
[214,"","","","","","",null,"","","","","","","",null,null,null,"","","","","","",""]
[215,"","","","","","",null,"","","","","","","",null,null,null,"","","","","","",""]
[216,"","","","","","",null,"","","","","","","",null,null,null,"","","","","","",""]
[217,"","","","","","",null,"","","","","","","",null,null,null,"","","","","","",""]
[218,"","","","","","",null,"","","","","","","",null,null,null,"","","","","","",""]
[219,"","","","","","",null,"","","","","","","",null,null,null,"","","","","","",""]
[220,"","","","","","",null,"","","","","","","",null,null,null,"","","","","","",""]
[221,"","","","","","",null,"","","","","","","",null,null,null,"","","","","","",""]
[222,"","","","","","",null,"","","","","","","",null,null,null,"","","","","","",""]
[223,"","","","","","",null,"","","","","","","",null,null,null,"","","","","","",""]
[224,"","","","","","",null,"","","","","","","",null,null,null,"","","","","","",""]
[225,"","","","","","",null,"","","","","","","",null,null,null,"","","","","","",""]
[226,"","","","","","",null,"","","","","","","",null,null,null,"","","","","","",""]
[227,"","","","","","",null,"","","","","","","",null,null,null,"","","","","","",""]
[228,"","","","","","",null,"","","","","","","",null,null,null,"","","","","","",""]
[229,"","","","","","",null,"","","","","","","",null,null,null,"","","","","","",""]
[230,"","","","","","",null,"","","","","","","",null,null,null,"","","","","","",""]
[231,"","","","","","",null,"","","","","","","",null,null,null,"","","","","","",""]
[232,"","","","","","",null,"","","","","","","",null,null,null,"","","","","","",""]
[233,"","","","","","",null,"","","","","","","",null,null,null,"","","","","","",""]
[234,"","","","","","",null,"","","","","","","",null,null,null,"","","","","","",""]
[235,"","","","","","",null,"","","","","","","",null,null,null,"","","","","","",""]
[236,"","","","","","",null,"","","","","","","",null,null,null,"","","","","","",""]
[237,"","","","","","",null,"","","","","","","",null,null,null,"","","","","","",""]
[238,"","","","","","",null,"","","","","","","",null,null,null,"","","","","","",""]
[239,"","","","","","",null,"","","","","","","",null,null,null,"","","","","","",""]
[240,"","","","","","",null,"","","","","","","",null,null,null,"","","","","","",""]
[241,"","","","","","",null,"","","","","","","",null,null,null,"","","","","","",""]
[242,"","","","","","",null,"","","","","","","",null,null,null,"","","","","","",""]
[243,"","","","","","",null,"","","","","","","",null,null,null,"","","","","","",""]
[244,"","","","","","",null,"","","","","","","",null,null,null,"","","","","","",""]
[245,"","","","","","",null,"","","","","","","",null,null,null,"","","","","","",""]
[246,"","","","","","",null,"","","","","","","",null,null,null,"","","","","","",""]
[247,"","","","","","",null,"","","","","","","",null,null,null,"","","","","","",""]
[248,"","","","","","",null,"","","","","","","",null,null,null,"","","","","","",""]
[249,"","","","","","",null,"","","","","","","",null,null,null,"","","","","","",""]
[250,"","","","","","",null,"","","","","","","",null,null,null,"","","","","","",""]
[251,"","","","","","",null,"","","","","","","",null,null,null,"","","","","","",""]
[252,"","","","","","",null,"","","","","","","",null,null,null,"","","","","","",""]
[253,"","","","","","",null,"","","","","","","",null,null,null,"","","","","","",""]
[254,"","","","","","",null,"","","","","","","",null,null,null,"","","","","","",""]
[255,"","","","","","",null,"","","","","","","",null,null,null,"","","","","","",""]
[256,"","","","","","",null,"","","","","","","",null,null,null,"","","","","","",""]
[257,"","","","","","",null,"","","","","","","",null,null,null,"","","","","","",""]
[258,"","","","","","",null,"","","","","","","",null,null,null,"","","","","","",""]
[259,"","","","","","",null,"","","","","","","",null,null,null,"","","","","","",""]
[260,"","","","","","",null,"","","","","","","",null,null,null,"","","","","","",""]
[261,"","","","","","",null,"","","","","","","",null,null,null,"","","","","","",""]
[262,"","","","","","",null,"","","","","","","",null,null,null,"","","","","","",""]
[263,"","","","","","",null,"","","","","","","",null,null,null,"","","","","","",""]
[264,"","","","","","",null,"","","","","","","",null,null,null,"","","","","","",""]
[265,"","","","","","",null,"","","","","","","",null,null,null,"","","","","","",""]
[266,"","","","","","",null,"","","","","","","",null,null,null,"","","","","","",""]
[267,"","","","","","",null,"","","","","","","",null,null,null,"","","","","","",""]
[268,"","","","","","",null,"","","","","","","",null,null,null,"","","","","","",""]
[269,"","","","","","",null,"","","","","","","",null,null,null,"","","","","","",""]
[270,"","","","","","",null,"","","","","","","",null,null,null,"","","","","","",""]
[271,"","","","","","",null,"","","","","","","",null,null,null,"","","","","","",""]
[272,"","","","","","",null,"","","","","","","",null,null,null,"","","","","","",""]
[273,"","","","","","",null,"","","","","","","",null,null,null,"","","","","","",""]
[274,"","","","","","",null,"","","","","","","",null,null,null,"","","","","","",""]
[275,"","","","","","",null,"","","","","","","",null,null,null,"","","","","","",""]
[276,"","","","","","",null,"","","","","","","",null,null,null,"","","","","","",""]
[277,"","","","","","",null,"","","","","","","",null,null,null,"","","","","","",""]
[278,"","","","","","",null,"","","","","","","",null,null,null,"","","","","","",""]
[279,"","","","","","",null,"","","","","","","",null,null,null,"","","","","","",""]
[280,"","","","","","",null,"","","","","","","",null,null,null,"","","","","","",""]

{"sheet":"Macro MinF","index":17,"n_rows":291,"n_cols":25,"rows_kept":291,"cut":false,"hidden":false,"merged":[[0,0,0,3]]}
["FONCTIONNEMENT DE LA MACRO"]
[1,"COLLER LES RESULTATS DANS LE TABLEAU DE GAUCHE"]
[2,"COPIER LA FORMULE",null,null,"=SI($D12=\"mf\";D12;\"\")"]
[]
[3,"FAIRE  UN COPIER COLLER DES VALEURS AVEC UN COLLAGE SPECIALE \"VALEURS\""]
[4,"Faire un trie ZA pour BF1 et bf2"]
[5,"coller dans la feuille "]
[]
[]
[]
["PLACES","NOMS","PRENOMS","CATE","ETABLISSEMENT","VILLE","N°",null,"PLACES","NOMS","PRENOMS","CATE","ETABLISSEMENT","VILLE","N°",null,null,null,"PLACES","NOMS","PRENOMS","CATE","ETABLISSEMENT","VILLE","N°"]
[1,"CUSSY","Eva","MF","J AMYOT","MELUN",0,null,1,"CUSSY","Eva","MF","J AMYOT","MELUN",0,null,null,null,11,"FAHIM","Zinab","CF","ELSA TRIOLET","LE MEE",0]
[2,"VIREVIALLE","justine","MF","J D'ARC","MELUN",0,null,2,"VIREVIALLE","justine","MF","J D'ARC","MELUN",0,null,null,null,44,"OUAZARI","Mina","CF","LA MARE AUX CHAMPS","VAUX",0]
[3,"VIGNAL","Margot","MF","J AMYOT","MELUN",0,null,3,"VIGNAL","Margot","MF","J AMYOT","MELUN",0,null,null,null,"","","","","","",""]
[4,"MASCARIN","Olivia","MF","R BONHEUR","LE CHATELET",0,null,4,"MASCARIN","Olivia","MF","R BONHEUR","LE CHATELET",0,null,null,null,"","","","","","",""]
[5,"HOUELLE","FLORIANE","MF","J AMYOT","MELUN",0,null,5,"HOUELLE","FLORIANE","MF","J AMYOT","MELUN",0,null,null,null,"","","","","","",""]
[6,"RIBEREAU-GAYON","Clotilde","MF","DE PISAN","PERTHES",0,null,6,"RIBEREAU-GAYON","Clotilde","MF","DE PISAN","PERTHES",0,null,null,null,"","","","","","",""]
[7,"LAIGLE","Héloïse","MF","CH PEGUY","VERNEUIL",0,null,7,"LAIGLE","Héloïse","MF","CH PEGUY","VERNEUIL",0,null,null,null,"","","","","","",""]
[8,"MICHAUD","Manon","MF","CH PEGUY","VERNEUIL",0,null,8,"MICHAUD","Manon","MF","CH PEGUY","VERNEUIL",0,null,null,null,"","","","","","",""]
[9,"INSINSKI","Mathilde","MF","J AMYOT","MELUN",0,null,9,"INSINSKI","Mathilde","MF","J AMYOT","MELUN",0,null,null,null,"","","","","","",""]
[10,"BOURGEOIS","Florine","MF","DE PISAN","PERTHES",0,null,10,"BOURGEOIS","Florine","MF","DE PISAN","PERTHES",0,null,null,null,"","","","","","",""]
[11,"FAHIM","Zinab","CF","ELSA TRIOLET","LE MEE",0,null,12,"SAWA","Ludivine","MF","J AMYOT","MELUN",0,null,null,null,"","","","","","",""]
[12,"SAWA","Ludivine","MF","J AMYOT","MELUN",0,null,13,"SIMONNOT","Axelle","MF","LA MARE AUX CHAMPS","VAUX",0,null,null,null,"","","","","","",""]
[13,"SIMONNOT","Axelle","MF","LA MARE AUX CHAMPS","VAUX",0,null,14,"BOUEDO","Annaelle","MF","NAZARETH","VOISENON",0,null,null,null,"","","","","","",""]
[14,"BOUEDO","Annaelle","MF","NAZARETH","VOISENON",0,null,15,"BARDOCHAN","Vanessa","MF","CH PEGUY","VERNEUIL",0,null,null,null,"","","","","","",""]
[15,"BARDOCHAN","Vanessa","MF","CH PEGUY","VERNEUIL",0,null,16,"FICHEUX","Juliette","MF","DE PISAN","PERTHES",0,null,null,null,"","","","","","",""]
[16,"FICHEUX","Juliette","MF","DE PISAN","PERTHES",0,null,17,"FLAMANT","Lisa","MF","DE PISAN","PERTHES",0,null,null,null,"","","","","","",""]
[17,"FLAMANT","Lisa","MF","DE PISAN","PERTHES",0,null,18,"RABHI","Abla","MF","BROSSOLETTE","MELUN",0,null,null,null,"","","","","","",""]
[18,"RABHI","Abla","MF","BROSSOLETTE","MELUN",0,null,19,"BRUNEL","Eva","MF","DE PISAN","PERTHES",0,null,null,null,"","","","","","",""]
[19,"BRUNEL","Eva","MF","DE PISAN","PERTHES",0,null,20,"HAUDRY","Juliette","MF","DOISNEAU","DAMMARIE",0,null,null,"","","","","","","",""]
[20,"HAUDRY","Juliette","MF","DOISNEAU","DAMMARIE",0,null,21,"SOAVE","Carla","MF","LA MARE AUX CHAMPS","VAUX",0,null,null,"","","","","","","",""]
[21,"SOAVE","Carla","MF","LA MARE AUX CHAMPS","VAUX",0,null,22,"DESCHAMPS","Emma","MF","CH PEGUY","VERNEUIL",0,null,null,"","","","","","","",""]
[22,"DESCHAMPS","Emma","MF","CH PEGUY","VERNEUIL",0,null,23,"KHATALI","Nesrine","MF","DOISNEAU","DAMMARIE",0,null,null,null,"","","","","","",""]
[23,"KHATALI","Nesrine","MF","DOISNEAU","DAMMARIE",0,null,24,"POITTEVIN","Jeanne","MF","LA MARE AUX CHAMPS","VAUX",0,null,null,null,"","","","","","",""]
[24,"POITTEVIN","Jeanne","MF","LA MARE AUX CHAMPS","VAUX",0,null,25,"BOULERY","Lou-Ann","MF","CAPUCINS","MELUN",0,null,null,null,"","","","","","",""]
[25,"BOULERY","Lou-Ann","MF","CAPUCINS","MELUN",0,null,26,"AUDAT","Moira","MF","LA MARE AUX CHAMPS","VAUX",0,null,null,null,"","","","","","",""]
[26,"AUDAT","Moira","MF","LA MARE AUX CHAMPS","VAUX",0,null,27,"CHAVES","Marie","MF","CH PEGUY","VERNEUIL",0,null,null,null,"","","","","","",""]
[27,"CHAVES","Marie","MF","CH PEGUY","VERNEUIL",0,null,28,"TEXIER","Athénaïs","MF","DE PISAN","PERTHES",0,null,null,null,"","","","","","",""]
[28,"TEXIER","Athénaïs","MF","DE PISAN","PERTHES",0,null,29,"PESTAT","Erelle","MF","DE PISAN","PERTHES",0,null,null,null,"","","","","","",""]
[29,"PESTAT","Erelle","MF","DE PISAN","PERTHES",0,null,30,"HAUSE","Solenn","MF","R BONHEUR","LE CHATELET",0,null,null,null,"","","","","","",""]
[30,"HAUSE","Solenn","MF","R BONHEUR","LE CHATELET",0,null,31,"PALUMBO","chloé","MF","J D'ARC","MELUN",0,null,null,null,"","","","","","",""]
[31,"PALUMBO","chloé","MF","J D'ARC","MELUN",0,null,32,"JOUAULT","Victoire","MF","CH PEGUY","VERNEUIL",0,null,null,null,"","","","","","",""]
[32,"JOUAULT","Victoire","MF","CH PEGUY","VERNEUIL",0,null,33,"AGUEJGUAL","Zineb","MF","J AMYOT","MELUN",0,null,null,null,"","","","","","",""]
[33,"AGUEJGUAL","Zineb","MF","J AMYOT","MELUN",0,null,34,"GAIGNON","Léna","MF","R BONHEUR","LE CHATELET",0,null,null,null,"","","","","","",""]
[34,"GAIGNON","Léna","MF","R BONHEUR","LE CHATELET",0,null,35,"AUGUSTO","Elanore","MF","BROSSOLETTE","MELUN",0,null,null,"","","","","","","",""]
[35,"AUGUSTO","Elanore","MF","BROSSOLETTE","MELUN",0,null,36,"DESRUELLES","Lola","MF","LA MARE AUX CHAMPS","VAUX",0,null,null,"","","","","","","",""]
[36,"DESRUELLES","Lola","MF","LA MARE AUX CHAMPS","VAUX",0,null,37,"COURBET","LUCIE","MF","R BONHEUR","LE CHATELET",0,null,null,"","","","","","","",""]
[37,"COURBET","LUCIE","MF","R BONHEUR","LE CHATELET",0,null,38,"HAREL","Marie","MF","CH PEGUY","VERNEUIL",0,null,null,"","","","","","","",""]
[38,"HAREL","Marie","MF","CH PEGUY","VERNEUIL",0,null,39,"MICAELI","Oceane","MF","CH PEGUY","VERNEUIL",0,null,null,"","","","","","","",""]
[39,"MICAELI","Oceane","MF","CH PEGUY","VERNEUIL",0,null,40,"MADIABOLA","Megane","MF","J AMYOT","MELUN",0,null,null,"","","","","","","",""]
[40,"MADIABOLA","Megane","MF","J AMYOT","MELUN",0,null,41,"MOREIRA","Julie","MF","J AMYOT","MELUN",0,null,null,"","","","","","","",""]
[41,"MOREIRA","Julie","MF","J AMYOT","MELUN",0,null,42,"BERTRAND","Cassandra","MF","LA MARE AUX CHAMPS","VAUX",0,null,null,"","","","","","","",""]
[42,"BERTRAND","Cassandra","MF","LA MARE AUX CHAMPS","VAUX",0,null,43,"BENSAID","Amira","MF","LA FONTAINE","LE MEE",0,null,null,"","","","","","","",""]
[43,"BENSAID","Amira","MF","LA FONTAINE","LE MEE",0,null,45,"CASIMIRIUS","Janna","MF","CH PEGUY","VERNEUIL",0,null,null,"","","","","","","",""]
[44,"OUAZARI","Mina","CF","LA MARE AUX CHAMPS","VAUX",0,null,46,"CHABLIS","Merveille","MF","BROSSOLETTE","MELUN",0,null,null,"","","","","","","",""]
[45,"CASIMIRIUS","Janna","MF","CH PEGUY","VERNEUIL",0,null,47,"CISSE","Salimata","MF","ELSA TRIOLET","LE MEE",0,null,null,"","","","","","","",""]
[46,"CHABLIS","Merveille","MF","BROSSOLETTE","MELUN",0,null,48,"ROULY","Alicia","MF","CH PEGUY","VERNEUIL",0,null,null,"","","","","","","",""]
[47,"CISSE","Salimata","MF","ELSA TRIOLET","LE MEE",0,null,49,"CHEVILLOT ","Gwladys","MF","R BONHEUR","LE CHATELET",0,null,null,"","","","","","","",""]
[48,"ROULY","Alicia","MF","CH PEGUY","VERNEUIL",0,null,50,"QUEMADO","JULIE","MF","CH PEGUY","VERNEUIL",0,null,null,"","","","","","","",""]
[49,"CHEVILLOT ","Gwladys","MF","R BONHEUR","LE CHATELET",0,null,51,"ARZUR","Alison","MF","ELSA TRIOLET","LE MEE",0,null,null,"","","","","","","",""]
[50,"QUEMADO","JULIE","MF","CH PEGUY","VERNEUIL",0,null,52,"ARTHUS","Venus","MF","LA MARE AUX CHAMPS","VAUX",0,null,null,"","","","","","","",""]
[51,"ARZUR","Alison","MF","ELSA TRIOLET","LE MEE",0,null,53,"DELUGE","Mélissa","MF","CHOPIN","MELUN",0,null,null,"","","","","","","",""]
[52,"ARTHUS","Venus","MF","LA MARE AUX CHAMPS","VAUX",0,null,54,"HOURDEAU","Maëlie","MF","CH PEGUY","VERNEUIL",0,null,null,"","","","","","","",""]
[53,"DELUGE","Mélissa","MF","CHOPIN","MELUN",0,null,55,"BENZIANE","Halima","MF","CHOPIN","MELUN",0,null,null,"","","","","","","",""]
[54,"HOURDEAU","Maëlie","MF","CH PEGUY","VERNEUIL",0,null,56,"CLOAREC","HANNAH","MF","CH PEGUY","VERNEUIL",0,null,null,"","","","","","","",""]
[55,"BENZIANE","Halima","MF","CHOPIN","MELUN",0,null,57,"HADBI ","Soulaf","MF","CHOPIN","MELUN",0,null,null,"","","","","","","",""]
[56,"CLOAREC","HANNAH","MF","CH PEGUY","VERNEUIL",0,null,58,"CRESTO","Margot","MF","CH PEGUY","VERNEUIL",0,null,null,"","","","","","","",""]
[57,"HADBI ","Soulaf","MF","CHOPIN","MELUN",0,null,59,"JAOUAL","Rim","MF","ELSA TRIOLET","LE MEE",0,null,"","","","","","","","",""]
[58,"CRESTO","Margot","MF","CH PEGUY","VERNEUIL",0,null,60,"YESILTAS","Derya","MF","DOISNEAU","DAMMARIE",0,null,null,"","","","","","","",""]
[59,"JAOUAL","Rim","MF","ELSA TRIOLET","LE MEE",0,null,61,"GALLEGO","Lea","MF","CH PEGUY","VERNEUIL",0,null,null,"","","","","","","",""]
[60,"YESILTAS","Derya","MF","DOISNEAU","DAMMARIE",0,null,62,"VANG","Océane","MF","BROSSOLETTE","MELUN",0,null,null,"","","","","","","",""]
[61,"GALLEGO","Lea","MF","CH PEGUY","VERNEUIL",0,null,63,"LOVERA","Pauline","MF","CH PEGUY","VERNEUIL",0,null,null,"","","","","","","",""]
[62,"VANG","Océane","MF","BROSSOLETTE","MELUN",0,null,64,"POMART","Eugénie","MF","CH PEGUY","VERNEUIL",0,null,null,"","","","","","","",""]
[63,"LOVERA","Pauline","MF","CH PEGUY","VERNEUIL",0,null,65,"RAMDANE","Malika","MF","ELSA TRIOLET","LE MEE",0,null,null,"","","","","","","",""]
[64,"POMART","Eugénie","MF","CH PEGUY","VERNEUIL",0,null,66,"HOARAU","Maëva","MF","R BONHEUR","LE CHATELET",0,null,null,"","","","","","","",""]
[65,"RAMDANE","Malika","MF","ELSA TRIOLET","LE MEE",0,null,67,"ANDRIEU","Sidonie","MF","LA MARE AUX CHAMPS","VAUX",0,null,null,"","","","","","","",""]
[66,"HOARAU","Maëva","MF","R BONHEUR","LE CHATELET",0,null,68,"PRAVET","Lilou","MF","R BONHEUR","LE CHATELET",0,null,null,"","","","","","","",""]
[67,"ANDRIEU","Sidonie","MF","LA MARE AUX CHAMPS","VAUX",0,null,69,"LE SAUX","Mathilde","MF","R BONHEUR","LE CHATELET",0,null,null,"","","","","","","",""]
[68,"PRAVET","Lilou","MF","R BONHEUR","LE CHATELET",0,null,70,"DE ARAUJO","Maëlys","MF","NAZARETH","VOISENON",0,null,null,"","","","","","","",""]
[69,"LE SAUX","Mathilde","MF","R BONHEUR","LE CHATELET",0,null,71,"GORGE BERNAT","Clara","MF","LA MARE AUX CHAMPS","VAUX",0,null,null,"","","","","","","",""]
[70,"DE ARAUJO","Maëlys","MF","NAZARETH","VOISENON",0,null,72,"DELCAME","Lunna","MF","CH PEGUY","VERNEUIL",0,null,null,"","","","","","","",""]
[71,"GORGE BERNAT","Clara","MF","LA MARE AUX CHAMPS","VAUX",0,null,73,"LE PRAEL","Léa","MF","CH PEGUY","VERNEUIL",0,null,null,"","","","","","","",""]
[72,"DELCAME","Lunna","MF","CH PEGUY","VERNEUIL",0,null,74,"ROGIER","Manuella","MF","LA FONTAINE","LE MEE",0,null,null,"","","","","","","",""]
[73,"LE PRAEL","Léa","MF","CH PEGUY","VERNEUIL",0,null,75,"JOYEZ","Ambre","MF","CH PEGUY","VERNEUIL",0,null,null,"","","","","","","",""]
[74,"ROGIER","Manuella","MF","LA FONTAINE","LE MEE",0,null,76,"LABBEZ","Thiphaine","MF","ELSA TRIOLET","LE MEE",0,null,null,"","","","","","","",""]
[75,"JOYEZ","Ambre","MF","CH PEGUY","VERNEUIL",0,null,77,"FONSECA","Morine","MF","CH PEGUY","VERNEUIL",0,null,null,"","","","","","","",""]
[76,"LABBEZ","Thiphaine","MF","ELSA TRIOLET","LE MEE",0,null,78,"JACQUEMIN","Auriane","MF","CH PEGUY","VERNEUIL",0,null,null,"","","","","","","",""]
[77,"FONSECA","Morine","MF","CH PEGUY","VERNEUIL",0,null,79,"GOMEZ CALLO","Gwendoline","MF","LA MARE AUX CHAMPS","VAUX",0,null,null,"","","","","","","",""]
[78,"JACQUEMIN","Auriane","MF","CH PEGUY","VERNEUIL",0,null,80,"BADER","Helene","MF","LA MARE AUX CHAMPS","VAUX",0,null,null,"","","","","","","",""]
[79,"GOMEZ CALLO","Gwendoline","MF","LA MARE AUX CHAMPS","VAUX",0,null,81,"FERNANDEZ","Elsa","MF","LA MARE AUX CHAMPS","VAUX",0,null,null,"","","","","","","",""]
[80,"BADER","Helene","MF","LA MARE AUX CHAMPS","VAUX",0,null,82,"PAISLEY","Laure","MF","LA MARE AUX CHAMPS","VAUX",0,null,null,"","","","","","","",""]
[81,"FERNANDEZ","Elsa","MF","LA MARE AUX CHAMPS","VAUX",0,null,83,"KUHN","Justine","MF","CH PEGUY","VERNEUIL",0,null,null,"","","","","","","",""]
[82,"PAISLEY","Laure","MF","LA MARE AUX CHAMPS","VAUX",0,null,84,"ZEGHOUDI","Noria","MF","CAPUCINS","MELUN",0,null,null,"","","","","","","",""]
[83,"KUHN","Justine","MF","CH PEGUY","VERNEUIL",0,null,85,"ABDEL WEDOUD","Zeinabou","MF","LA FONTAINE","LE MEE",0,null,null,"","","","","","","",""]
[84,"ZEGHOUDI","Noria","MF","CAPUCINS","MELUN",0,null,86,"ZEKER","EZGI","MF","J AMYOT","MELUN",0,null,null,"","","","","","","",""]
[85,"ABDEL WEDOUD","Zeinabou","MF","LA FONTAINE","LE MEE",0,null,87,"RHENZOUR","Soumaya","MF","LA FONTAINE","LE MEE",0,null,null,"","","","","","","",""]
[86,"ZEKER","EZGI","MF","J AMYOT","MELUN",0,null,"","","","","","","",null,null,"","","","","","","",""]
[87,"RHENZOUR","Soumaya","MF","LA FONTAINE","LE MEE",0,null,"","","","","","","",null,null,"","","","","","","",""]
[88,"","","","","","",null,"","","","","","","",null,null,"","","","","","","",""]
[89,"","","","","","",null,"","","","","","","",null,null,"","","","","","","",""]
[90,"","","","","","",null,"","","","","","","",null,null,"","","","","","","",""]
[91,"","","","","","",null,"","","","","","","",null,null,"","","","","","","",""]
[92,"","","","","","",null,"","","","","","","",null,null,"","","","","","","",""]
[93,"","","","","","",null,"","","","","","","",null,null,"","","","","","","",""]
[94,"","","","","","",null,"","","","","","","",null,null,"","","","","","","",""]
[95,"","","","","","",null,"","","","","","","",null,null,"","","","","","","",""]
[96,"","","","","","",null,"","","","","","","",null,null,"","","","","","","",""]
[97,"","","","","","",null,"","","","","","","",null,null,"","","","","","","",""]
[98,"","","","","","",null,"","","","","","","",null,null,"","","","","","","",""]
[99,"","","","","","",null,"","","","","","","",null,null,"","","","","","","",""]
[100,"","","","","","",null,"","","","","","","",null,null,"","","","","","","",""]
[101,"","","","","","",null,"","","","","","","",null,null,"","","","","","","",""]
[102,"","","","","","",null,"","","","","","","",null,null,"","","","","","","",""]
[103,"","","","","","",null,"","","","","","","",null,null,"","","","","","","",""]
[104,"","","","","","",null,"","","","","","","",null,null,"","","","","","","",""]
[105,"","","","","","",null,"","","","","","","",null,null,"","","","","","","",""]
[106,"","","","","","",null,"","","","","","","",null,null,"","","","","","","",""]
[107,"","","","","","",null,"","","","","","","",null,null,"","","","","","","",""]
[108,"","","","","","",null,"","","","","","","",null,null,"","","","","","","",""]
[109,"","","","","","",null,"","","","","","","",null,null,"","","","","","","",""]
[110,"","","","","","",null,"","","","","","","",null,null,"","","","","","","",""]
[111,"","","","","","",null,"","","","","","","",null,null,"","","","","","","",""]
[112,"","","","","","",null,"","","","","","","",null,null,"","","","","","","",""]
[113,"","","","","","",null,"","","","","","","",null,null,"","","","","","","",""]
[114,"","","","","","",null,"","","","","","","",null,null,"","","","","","","",""]
[115,"","","","","","",null,"","","","","","","",null,null,"","","","","","","",""]
[116,"","","","","","",null,"","","","","","","",null,null,"","","","","","","",""]
[117,"","","","","","",null,"","","","","","","",null,null,"","","","","","","",""]
[118,"","","","","","",null,"","","","","","","",null,null,"","","","","","","",""]
[119,"","","","","","",null,"","","","","","","",null,null,"","","","","","","",""]
[120,"","","","","","",null,"","","","","","","",null,null,"","","","","","","",""]
[121,"","","","","","",null,"","","","","","","",null,null,"","","","","","","",""]
[122,"","","","","","",null,"","","","","","","",null,null,"","","","","","","",""]
[123,"","","","","","",null,"","","","","","","",null,null,"","","","","","","",""]
[124,"","","","","","",null,"","","","","","","",null,null,"","","","","","","",""]
[125,"","","","","","",null,"","","","","","","",null,null,"","","","","","","",""]
[126,"","","","","","",null,"","","","","","","",null,null,"","","","","","","",""]
[127,"","","","","","",null,"","","","","","","",null,null,"","","","","","","",""]
[128,"","","","","","",null,"","","","","","","",null,null,"","","","","","","",""]
[129,"","","","","","",null,"","","","","","","",null,null,"","","","","","","",""]
[130,"","","","","","",null,"","","","","","","",null,null,"","","","","","","",""]
[131,"","","","","","",null,"","","","","","","",null,null,null,"","","","","","",""]
[132,"","","","","","",null,"","","","","","","",null,null,null,"","","","","","",""]
[133,"","","","","","",null,"","","","","","","",null,null,null,"","","","","","",""]
[134,"","","","","","",null,"","","","","","","",null,null,null,"","","","","","",""]
[135,"","","","","","",null,"","","","","","","",null,null,null,"","","","","","",""]
[136,"","","","","","",null,"","","","","","","",null,null,null,"","","","","","",""]
[137,"","","","","","",null,"","","","","","","",null,null,null,"","","","","","",""]
[138,"","","","","","",null,"","","","","","","",null,null,null,"","","","","","",""]
[139,"","","","","","",null,"","","","","","","",null,null,null,"","","","","","",""]
[140,"","","","","","",null,"","","","","","","",null,null,null,"","","","","","",""]
[141,"","","","","","",null,"","","","","","","",null,null,null,"","","","","","",""]
[142,"","","","","","",null,"","","","","","","",null,null,null,"","","","","","",""]
[143,"","","","","","",null,"","","","","","","",null,null,null,"","","","","","",""]
[144,"","","","","","",null,"","","","","","","",null,null,null,"","","","","","",""]
[145,"","","","","","",null,"","","","","","","",null,null,null,"","","","","","",""]
[146,"","","","","","",null,"","","","","","","",null,null,null,"","","","","","",""]
[147,"","","","","","",null,"","","","","","","",null,null,null,"","","","","","",""]
[148,"","","","","","",null,"","","","","","","",null,null,null,"","","","","","",""]
[149,"","","","","","",null,"","","","","","","",null,null,null,"","","","","","",""]
[150,"","","","","","",null,"","","","","","","",null,null,null,"","","","","","",""]
[151,"","","","","","",null,"","","","","","","",null,null,null,"","","","","","",""]
[152,"","","","","","",null,"","","","","","","",null,null,null,"","","","","","",""]
[153,"","","","","","",null,"","","","","","","",null,null,null,"","","","","","",""]
[154,"","","","","","",null,"","","","","","","",null,null,null,"","","","","","",""]
[155,"","","","","","",null,"","","","","","","",null,null,null,"","","","","","",""]
[156,"","","","","","",null,"","","","","","","",null,null,null,"","","","","","",""]
[157,"","","","","","",null,"","","","","","","",null,null,null,"","","","","","",""]
[158,"","","","","","",null,"","","","","","","",null,null,null,"","","","","","",""]
[159,"","","","","","",null,"","","","","","","",null,null,null,"","","","","","",""]
[160,"","","","","","",null,"","","","","","","",null,null,null,"","","","","","",""]
[161,"","","","","","",null,"","","","","","","",null,null,null,"","","","","","",""]
[162,"","","","","","",null,"","","","","","","",null,null,null,"","","","","","",""]
[163,"","","","","","",null,"","","","","","","",null,null,null,"","","","","","",""]
[164,"","","","","","",null,"","","","","","","",null,null,null,"","","","","","",""]
[165,"","","","","","",null,"","","","","","","",null,null,null,"","","","","","",""]
[166,"","","","","","",null,"","","","","","","",null,null,null,"","","","","","",""]
[167,"","","","","","",null,"","","","","","","",null,null,null,"","","","","","",""]
[168,"","","","","","",null,"","","","","","","",null,null,null,"","","","","","",""]
[169,"","","","","","",null,"","","","","","","",null,null,null,"","","","","","",""]
[170,"","","","","","",null,"","","","","","","",null,null,null,"","","","","","",""]
[171,"","","","","","",null,"","","","","","","",null,null,null,"","","","","","",""]
[172,"","","","","","",null,"","","","","","","",null,null,null,"","","","","","",""]
[173,"","","","","","",null,"","","","","","","",null,null,null,"","","","","","",""]
[174,"","","","","","",null,"","","","","","","",null,null,null,"","","","","","",""]
[175,"","","","","","",null,"","","","","","","",null,null,null,"","","","","","",""]
[176,"","","","","","",null,"","","","","","","",null,null,null,"","","","","","",""]
[177,"","","","","","",null,"","","","","","","",null,null,null,"","","","","","",""]
[178,"","","","","","",null,"","","","","","","",null,null,null,"","","","","","",""]
[179,"","","","","","",null,"","","","","","","",null,null,null,"","","","","","",""]
[180,"","","","","","",null,"","","","","","","",null,null,null,"","","","","","",""]
[181,"","","","","","",null,"","","","","","","",null,null,null,"","","","","","",""]
[182,"","","","","","",null,"","","","","","","",null,null,null,"","","","","","",""]
[183,"","","","","","",null,"","","","","","","",null,null,null,"","","","","","",""]
[184,"","","","","","",null,"","","","","","","",null,null,null,"","","","","","",""]
[185,"","","","","","",null,"","","","","","","",null,null,null,"","","","","","",""]
[186,"","","","","","",null,"","","","","","","",null,null,null,"","","","","","",""]
[187,"","","","","","",null,"","","","","","","",null,null,null,"","","","","","",""]
[188,"","","","","","",null,"","","","","","","",null,null,null,"","","","","","",""]
[189,"","","","","","",null,"","","","","","","",null,null,null,"","","","","","",""]
[190,"","","","","","",null,"","","","","","","",null,null,null,"","","","","","",""]
[191,"","","","","","",null,"","","","","","","",null,null,null,"","","","","","",""]
[192,"","","","","","",null,"","","","","","","",null,null,null,"","","","","","",""]
[193,"","","","","","",null,"","","","","","","",null,null,null,"","","","","","",""]
[194,"","","","","","",null,"","","","","","","",null,null,null,"","","","","","",""]
[195,"","","","","","",null,"","","","","","","",null,null,null,"","","","","","",""]
[196,"","","","","","",null,"","","","","","","",null,null,null,"","","","","","",""]
[197,"","","","","","",null,"","","","","","","",null,null,null,"","","","","","",""]
[198,"","","","","","",null,"","","","","","","",null,null,null,"","","","","","",""]
[199,"","","","","","",null,"","","","","","","",null,null,null,"","","","","","",""]
[200,"","","","","","",null,"","","","","","","",null,null,null,"","","","","","",""]
[201,"","","","","","",null,"","","","","","","",null,null,null,"","","","","","",""]
[202,"","","","","","",null,"","","","","","","",null,null,null,"","","","","","",""]
[203,"","","","","","",null,"","","","","","","",null,null,null,"","","","","","",""]
[204,"","","","","","",null,"","","","","","","",null,null,null,"","","","","","",""]
[205,"","","","","","",null,"","","","","","","",null,null,null,"","","","","","",""]
[206,"","","","","","",null,"","","","","","","",null,null,null,"","","","","","",""]
[207,"","","","","","",null,"","","","","","","",null,null,null,"","","","","","",""]
[208,"","","","","","",null,"","","","","","","",null,null,null,"","","","","","",""]
[209,"","","","","","",null,"","","","","","","",null,null,null,"","","","","","",""]
[210,"","","","","","",null,"","","","","","","",null,null,null,"","","","","","",""]
[211,"","","","","","",null,"","","","","","","",null,null,null,"","","","","","",""]
[212,"","","","","","",null,"","","","","","","",null,null,null,"","","","","","",""]
[213,"","","","","","",null,"","","","","","","",null,null,null,"","","","","","",""]
[214,"","","","","","",null,"","","","","","","",null,null,null,"","","","","","",""]
[215,"","","","","","",null,"","","","","","","",null,null,null,"","","","","","",""]
[216,"","","","","","",null,"","","","","","","",null,null,null,"","","","","","",""]
[217,"","","","","","",null,"","","","","","","",null,null,null,"","","","","","",""]
[218,"","","","","","",null,"","","","","","","",null,null,null,"","","","","","",""]
[219,"","","","","","",null,"","","","","","","",null,null,null,"","","","","","",""]
[220,"","","","","","",null,"","","","","","","",null,null,null,"","","","","","",""]
[221,"","","","","","",null,"","","","","","","",null,null,null,"","","","","","",""]
[222,"","","","","","",null,"","","","","","","",null,null,null,"","","","","","",""]
[223,"","","","","","",null,"","","","","","","",null,null,null,"","","","","","",""]
[224,"","","","","","",null,"","","","","","","",null,null,null,"","","","","","",""]
[225,"","","","","","",null,"","","","","","","",null,null,null,"","","","","","",""]
[226,"","","","","","",null,"","","","","","","",null,null,null,"","","","","","",""]
[227,"","","","","","",null,"","","","","","","",null,null,null,"","","","","","",""]
[228,"","","","","","",null,"","","","","","","",null,null,null,"","","","","","",""]
[229,"","","","","","",null,"","","","","","","",null,null,null,"","","","","","",""]
[230,"","","","","","",null,"","","","","","","",null,null,null,"","","","","","",""]
[231,"","","","","","",null,"","","","","","","",null,null,null,"","","","","","",""]
[232,"","","","","","",null,"","","","","","","",null,null,null,"","","","","","",""]
[233,"","","","","","",null,"","","","","","","",null,null,null,"","","","","","",""]
[234,"","","","","","",null,"","","","","","","",null,null,null,"","","","","","",""]
[235,"","","","","","",null,"","","","","","","",null,null,null,"","","","","","",""]
[236,"","","","","","",null,"","","","","","","",null,null,null,"","","","","","",""]
[237,"","","","","","",null,"","","","","","","",null,null,null,"","","","","","",""]
[238,"","","","","","",null,"","","","","","","",null,null,null,"","","","","","",""]
[239,"","","","","","",null,"","","","","","","",null,null,null,"","","","","","",""]
[240,"","","","","","",null,"","","","","","","",null,null,null,"","","","","","",""]
[241,"","","","","","",null,"","","","","","","",null,null,null,"","","","","","",""]
[242,"","","","","","",null,"","","","","","","",null,null,null,"","","","","","",""]
[243,"","","","","","",null,"","","","","","","",null,null,null,"","","","","","",""]
[244,"","","","","","",null,"","","","","","","",null,null,null,"","","","","","",""]
[245,"","","","","","",null,"","","","","","","",null,null,null,"","","","","","",""]
[246,"","","","","","",null,"","","","","","","",null,null,null,"","","","","","",""]
[247,"","","","","","",null,"","","","","","","",null,null,null,"","","","","","",""]
[248,"","","","","","",null,"","","","","","","",null,null,null,"","","","","","",""]
[249,"","","","","","",null,"","","","","","","",null,null,null,"","","","","","",""]
[250,"","","","","","",null,"","","","","","","",null,null,null,"","","","","","",""]
[251,"","","","","","",null,"","","","","","","",null,null,null,"","","","","","",""]
[252,"","","","","","",null,"","","","","","","",null,null,null,"","","","","","",""]
[253,"","","","","","",null,"","","","","","","",null,null,null,"","","","","","",""]
[254,"","","","","","",null,"","","","","","","",null,null,null,"","","","","","",""]
[255,"","","","","","",null,"","","","","","","",null,null,null,"","","","","","",""]
[256,"","","","","","",null,"","","","","","","",null,null,null,"","","","","","",""]
[257,"","","","","","",null,"","","","","","","",null,null,null,"","","","","","",""]
[258,"","","","","","",null,"","","","","","","",null,null,null,"","","","","","",""]
[259,"","","","","","",null,"","","","","","","",null,null,null,"","","","","","",""]
[260,"","","","","","",null,"","","","","","","",null,null,null,"","","","","","",""]
[261,"","","","","","",null,"","","","","","","",null,null,null,"","","","","","",""]
[262,"","","","","","",null,"","","","","","","",null,null,null,"","","","","","",""]
[263,"","","","","","",null,"","","","","","","",null,null,null,"","","","","","",""]
[264,"","","","","","",null,"","","","","","","",null,null,null,"","","","","","",""]
[265,"","","","","","",null,"","","","","","","",null,null,null,"","","","","","",""]
[266,"","","","","","",null,"","","","","","","",null,null,null,"","","","","","",""]
[267,"","","","","","",null,"","","","","","","",null,null,null,"","","","","","",""]
[268,"","","","","","",null,"","","","","","","",null,null,null,"","","","","","",""]
[269,"","","","","","",null,"","","","","","","",null,null,null,"","","","","","",""]
[270,"","","","","","",null,"","","","","","","",null,null,null,"","","","","","",""]
[271,"","","","","","",null,"","","","","","","",null,null,null,"","","","","","",""]
[272,"","","","","","",null,"","","","","","","",null,null,null,"","","","","","",""]
[273,"","","","","","",null,"","","","","","","",null,null,null,"","","","","","",""]
[274,"","","","","","",null,"","","","","","","",null,null,null,"","","","","","",""]
[275,"","","","","","",null,"","","","","","","",null,null,null,"","","","","","",""]
[276,"","","","","","",null,"","","","","","","",null,null,null,"","","","","","",""]
[277,"","","","","","",null,"","","","","","","",null,null,null,"","","","","","",""]
[278,"","","","","","",null,"","","","","","","",null,null,null,"","","","","","",""]
[279,"","","","","","",null,"","","","","","","",null,null,null,"","","","","","",""]
[280,"","","","","","",null,"","","","","","","",null,null,null,"","","","","","",""]

{"sheet":"Résult Classes 3ème","index":18,"n_rows":57,"n_cols":5,"rows_kept":57,"cut":false,"hidden":false,"merged":[[15,0,18,0],[15,4,22,4],[19,0,22,0],[1,0,1,4],[4,0,7,0],[4,4,11,4],[8,0,11,0],[48,0,51,0],[48,4,55,4],[52,0,55,0],[26,0,29,0],[26,4,33,4],[30,0,33,0],[37,0,40,0],[37,4,44,4],[41,0,44,0]]}
[]
["LA CLASSE GAGNANTE EST CELLE QUI A LE MOINS DE POINTS"]
[]
["3EA",null,"NBRE \nDE POINTS","Nbre de Coureurs","TOTAL FILLES ET GARCONS"]
["COURSES\nFILLES","93-94",{"$f":"SUMIF('Classt BF 2'!$G$5:$G$123,\"3EA\",'Classt BF 2'!$C$5:$C$123)","v":0},{"$f":"(COUNTIF('Classt BF 2'!$G$5:$G$123,\"3EA\"))","v":0},{"$f":"SUM(C5:C11)/SUM(D5:D11)","v":{"$error":"#REF!"}}]
[null,92,{"$f":"SUMIF(#REF!,\"3EA\",#REF!)","v":{"$error":"#REF!"}},{"$f":"(COUNTIF(#REF!,\"3EA\"))","v":{"$error":"#REF!"}}]
[null,91,{"$f":"SUMIF(#REF!,\"3EA\",#REF!)","v":{"$error":"#REF!"}},{"$f":"(COUNTIF(#REF!,\"3EA\"))","v":{"$error":"#REF!"}}]
[null,90,{"$f":"SUMIF(#REF!,\"3EA\",#REF!)","v":{"$error":"#REF!"}},{"$f":"(COUNTIF(#REF!,\"3EA\"))","v":{"$error":"#REF!"}}]
["COURSES \nGARCONS",{"$f":"B5","v":"93-94"},{"$f":"SUMIF(#REF!,\"3EA\",#REF!)","v":{"$error":"#REF!"}},{"$f":"(COUNTIF(#REF!,\"3EA\"))","v":{"$error":"#REF!"}}]
[null,{"$f":"B6","v":92},{"$f":"SUMIF(#REF!,\"3EA\",#REF!)","v":{"$error":"#REF!"}},{"$f":"(COUNTIF(#REF!,\"3EA\"))","v":{"$error":"#REF!"}}]
[null,{"$f":"B7","v":91},{"$f":"SUMIF(#REF!,\"3EA\",#REF!)","v":{"$error":"#REF!"}},{"$f":"(COUNTIF(#REF!,\"3EA\"))","v":{"$error":"#REF!"}}]
[null,90,{"$f":"SUMIF(#REF!,\"3EA\",#REF!)","v":{"$error":"#REF!"}},{"$f":"(COUNTIF(#REF!,\"3EA\"))","v":{"$error":"#REF!"}}]
[null,null,null,{"$f":"SUM(D5:D12)","v":{"$error":"#REF!"}}]
[]
["3EB",null,"NBRE \nDE POINTS","Nbre de Coureurs","TOTAL FILLES ET GARCONS"]
["COURSES\nFILLES",{"$f":"B5","v":"93-94"},{"$f":"SUMIF('Classt BF 2'!$G$5:$G$123,\"3EB\",'Classt BF 2'!$C$5:$C$123)","v":0},{"$f":"(COUNTIF('Classt BF 2'!$G$5:$G$123,\"3EB\"))","v":0},{"$f":"SUM(C16:C22)/SUM(D16:D22)","v":{"$error":"#REF!"}}]
[null,{"$f":"B6","v":92},{"$f":"SUMIF(#REF!,\"3EB\",#REF!)","v":{"$error":"#REF!"}},{"$f":"(COUNTIF(#REF!,\"3EB\"))","v":{"$error":"#REF!"}}]
[null,91,{"$f":"SUMIF(#REF!,\"3EB\",#REF!)","v":{"$error":"#REF!"}},{"$f":"(COUNTIF(#REF!,\"3EB\"))","v":{"$error":"#REF!"}}]
[null,90,{"$f":"SUMIF(#REF!,\"3EB\",#REF!)","v":{"$error":"#REF!"}},{"$f":"(COUNTIF(#REF!,\"3EB\"))","v":{"$error":"#REF!"}}]
["COURSES \nGARCONS","93-94",{"$f":"SUMIF(#REF!,\"3EB\",#REF!)","v":{"$error":"#REF!"}},{"$f":"(COUNTIF(#REF!,\"3EB\"))","v":{"$error":"#REF!"}}]
[null,92,{"$f":"SUMIF(#REF!,\"3EB\",#REF!)","v":{"$error":"#REF!"}},{"$f":"(COUNTIF(#REF!,\"3EB\"))","v":{"$error":"#REF!"}}]
[null,91,{"$f":"SUMIF(#REF!,\"3EB\",#REF!)","v":{"$error":"#REF!"}},{"$f":"(COUNTIF(#REF!,\"3EB\"))","v":{"$error":"#REF!"}}]
[null,90,{"$f":"SUMIF(#REF!,\"3EB\",#REF!)","v":{"$error":"#REF!"}},{"$f":"(COUNTIF(#REF!,\"3EB\"))","v":{"$error":"#REF!"}}]
[null,null,null,{"$f":"SUM(D16:D23)","v":{"$error":"#REF!"}}]
[]
["3EC",null,"NBRE \nDE POINTS","Nbre de Coureurs","TOTAL FILLES ET GARCONS"]
["COURSES\nFILLES",{"$f":"B16","v":"93-94"},{"$f":"SUMIF('Classt BF 2'!$G$5:$G$123,\"3EC\",'Classt BF 2'!$C$5:$C$123)","v":0},{"$f":"(COUNTIF('Classt BF 2'!$G$5:$G$123,\"3EC\"))","v":0},{"$f":"SUM(C27:C33)/SUM(D27:D33)","v":{"$error":"#REF!"}}]
[null,92,{"$f":"SUMIF(#REF!,\"3EC\",#REF!)","v":{"$error":"#REF!"}},{"$f":"(COUNTIF(#REF!,\"3EC\"))","v":{"$error":"#REF!"}}]
[null,91,{"$f":"SUMIF(#REF!,\"3EC\",#REF!)","v":{"$error":"#REF!"}},{"$f":"(COUNTIF(#REF!,\"3EC\"))","v":{"$error":"#REF!"}}]
[null,90,{"$f":"SUMIF(#REF!,\"3EC\",#REF!)","v":{"$error":"#REF!"}},{"$f":"(COUNTIF(#REF!,\"3EC\"))","v":{"$error":"#REF!"}}]
["COURSES \nGARCONS",{"$f":"B27","v":"93-94"},{"$f":"SUMIF(#REF!,\"3EC\",#REF!)","v":{"$error":"#REF!"}},{"$f":"(COUNTIF(#REF!,\"3EC\"))","v":{"$error":"#REF!"}}]
[null,{"$f":"B28","v":92},{"$f":"SUMIF(#REF!,\"3EC\",#REF!)","v":{"$error":"#REF!"}},{"$f":"(COUNTIF(#REF!,\"3EC\"))","v":{"$error":"#REF!"}}]
[null,{"$f":"B29","v":91},{"$f":"SUMIF(#REF!,\"3EC\",#REF!)","v":{"$error":"#REF!"}},{"$f":"(COUNTIF(#REF!,\"3EC\"))","v":{"$error":"#REF!"}}]
[null,90,{"$f":"SUMIF(#REF!,\"3EC\",#REF!)","v":{"$error":"#REF!"}},{"$f":"(COUNTIF(#REF!,\"3EC\"))","v":{"$error":"#REF!"}}]
[null,null,null,{"$f":"SUM(D27:D34)","v":{"$error":"#REF!"}}]
[]
["3ED",null,"NBRE \nDE POINTS","Nbre de Coureurs","TOTAL FILLES ET GARCONS"]
["COURSES\nFILLES",{"$f":"B27","v":"93-94"},{"$f":"SUMIF('Classt BF 2'!$G$5:$G$123,\"3ED\",'Classt BF 2'!$C$5:$C$123)","v":0},{"$f":"(COUNTIF('Classt BF 2'!$G$5:$G$123,\"3ED\"))","v":0},{"$f":"SUM(C38:C44)/SUM(D38:D44)","v":{"$error":"#REF!"}}]
[null,{"$f":"B28","v":92},{"$f":"SUMIF(#REF!,\"3ED\",#REF!)","v":{"$error":"#REF!"}},{"$f":"(COUNTIF(#REF!,\"3ED\"))","v":{"$error":"#REF!"}}]
[null,91,{"$f":"SUMIF(#REF!,\"3ED\",#REF!)","v":{"$error":"#REF!"}},{"$f":"(COUNTIF(#REF!,\"3ED\"))","v":{"$error":"#REF!"}}]
[null,90,{"$f":"SUMIF(#REF!,\"3ED\",#REF!)","v":{"$error":"#REF!"}},{"$f":"(COUNTIF(#REF!,\"3ED\"))","v":{"$error":"#REF!"}}]
["COURSES \nGARCONS","93-94",{"$f":"SUMIF(#REF!,\"3ED\",#REF!)","v":{"$error":"#REF!"}},{"$f":"(COUNTIF(#REF!,\"3ED\"))","v":{"$error":"#REF!"}}]
[null,92,{"$f":"SUMIF(#REF!,\"3ED\",#REF!)","v":{"$error":"#REF!"}},{"$f":"(COUNTIF(#REF!,\"3ED\"))","v":{"$error":"#REF!"}}]
[null,91,{"$f":"SUMIF(#REF!,\"3ED\",#REF!)","v":{"$error":"#REF!"}},{"$f":"(COUNTIF(#REF!,\"3ED\"))","v":{"$error":"#REF!"}}]
[null,90,{"$f":"SUMIF(#REF!,\"3ED\",#REF!)","v":{"$error":"#REF!"}},{"$f":"(COUNTIF(#REF!,\"3ED\"))","v":{"$error":"#REF!"}}]
[null,null,null,{"$f":"SUM(D38:D45)","v":{"$error":"#REF!"}}]
[]
["3EE",null,"NBRE \nDE POINTS","Nbre de Coureurs","TOTAL FILLES ET GARCONS"]
["COURSES\nFILLES",{"$f":"B38","v":"93-94"},{"$f":"SUMIF('Classt BF 2'!$G$5:$G$123,\"3EE\",'Classt BF 2'!$C$5:$C$123)","v":0},{"$f":"(COUNTIF('Classt BF 2'!$G$5:$G$123,\"3EE\"))","v":0},{"$f":"SUM(C49:C55)/SUM(D49:D55)","v":{"$error":"#REF!"}}]
[null,{"$f":"B39","v":92},{"$f":"SUMIF(#REF!,\"3EE\",#REF!)","v":{"$error":"#REF!"}},{"$f":"(COUNTIF(#REF!,\"3EE\"))","v":{"$error":"#REF!"}}]
[null,91,{"$f":"SUMIF(#REF!,\"3EE\",#REF!)","v":{"$error":"#REF!"}},{"$f":"(COUNTIF(#REF!,\"3EE\"))","v":{"$error":"#REF!"}}]
[null,90,{"$f":"SUMIF(#REF!,\"3EE\",#REF!)","v":{"$error":"#REF!"}},{"$f":"(COUNTIF(#REF!,\"3EE\"))","v":{"$error":"#REF!"}}]
["COURSES \nGARCONS","93-94",{"$f":"SUMIF(#REF!,\"3EE\",#REF!)","v":{"$error":"#REF!"}},{"$f":"(COUNTIF(#REF!,\"3EE\"))","v":{"$error":"#REF!"}}]
[null,92,{"$f":"SUMIF(#REF!,\"3EE\",#REF!)","v":{"$error":"#REF!"}},{"$f":"(COUNTIF(#REF!,\"3EE\"))","v":{"$error":"#REF!"}}]
[null,91,{"$f":"SUMIF(#REF!,\"3EE\",#REF!)","v":{"$error":"#REF!"}},{"$f":"(COUNTIF(#REF!,\"3EE\"))","v":{"$error":"#REF!"}}]
[null,90,{"$f":"SUMIF(#REF!,\"3EE\",#REF!)","v":{"$error":"#REF!"}},{"$f":"(COUNTIF(#REF!,\"3EE\"))","v":{"$error":"#REF!"}}]
[null,null,null,{"$f":"SUM(D49:D56)","v":{"$error":"#REF!"}}]

{"sheet":"d","index":19,"n_rows":0,"n_cols":0,"rows_kept":0,"cut":false,"hidden":false,"merged":[]}